Reaction Details
TargetReplicase polyprotein 1ab
LigandBDBM442792
Substrate/Competitorn/a
Meas. Tech.fluorescent peptide assay
Ki 46±2.90 nM
IC50 47±3.00 nM
Citation Yang, KSMa, XRMa, YAlugubelli, YRScott, DAVatansever, ECDrelich, AKSankaran, BGeng, ZZBlankenship, LRWard, HESheng, YJHsu, JCKratch, KCZhao, BHayatshahi, HSLiu, JLi, PFierke, CATseng, CKXu, SLiu, WR A Quick Route to Multiple Highly Potent SARS-CoV-2 Main Protease Inhibitors ChemMedChem0:0 (2020) 
 
Replicase polyprotein 1ab
Name:Replicase polyprotein 1ab
Type:Protein
Mol. Mass.:794070.71
Organism:2019-nCoV
Description:P0DTD1
Residue:7096
BDBM442792
NameBDBM442792
Synonyms:MPI7
TypeSmall organic molecule
Emp. Form.C32H42N4O7
Mol. Mass.594.6985
SMILESCC(OC(C)(C)C)[C@H](NC(=O)OCc1ccccc1)C(=O)N[C@@H](Cc1ccccc1)C(=O)N[C@@H](C[C@@H]1CCNC1=O)C=O