Reaction Details
TargetReplicase polyprotein 1ab
LigandBDBM429100
Substrate/Competitorn/a
Meas. Tech.fluorescent peptide assay
Ki 103±22 nM
IC50 105±22 nM
Citation Yang, KSMa, XRMa, YAlugubelli, YRScott, DAVatansever, ECDrelich, AKSankaran, BGeng, ZZBlankenship, LRWard, HESheng, YJHsu, JCKratch, KCZhao, BHayatshahi, HSLiu, JLi, PFierke, CATseng, CKXu, SLiu, WR A Quick Route to Multiple Highly Potent SARS-CoV-2 Main Protease Inhibitors ChemMedChem0:0 (2020) 
 
Replicase polyprotein 1ab
Name:Replicase polyprotein 1ab
Type:Protein
Mol. Mass.:794070.71
Organism:2019-nCoV
Description:P0DTD1
Residue:7096
BDBM429100
NameBDBM429100
Synonyms:MPI8 | jm5b01461, Compound 45
TypeSmall Organic Molecule
Emp. Form.C32H48N4O7
Mol. Mass.600.7461
SMILESCC(OC(C)(C)C)[C@H](NC(=O)OCc1ccccc1)C(=O)N[C@@H](CC1CCCCC1)C(=O)N[C@@H](C[C@@H]1CCNC1=O)C=O