Reaction Details
TargetE3 ubiquitin-protein ligase Mdm2 [1-188]
LigandBDBM299604
Substrate/Competitorn/a
Meas. Tech.Homogenous Time-Resolved Fluorescence Assay (HTRF2 Assay)
IC50 0.200±n/a nM
Citation Bartberger, MDGonzalez Buenrostro, ABeck, HPChen, XConnors, RVDeignan, JDuquette, JAEksterowicz, JFisher, BFox, BMFu, JFu, ZGonzalez Lopez De Turiso, FGribble, Jr., MWGustin, DJHeath, JAHuang, XJiao, XJohnson, MGKayser, FKopecky, DJLai, SLi, YLi, ZLiu, JLow, JDLucas, BSMa, ZMcGee, LRMcIntosh, JMcMinn, DLMedina, JCMihalic, JTOlson, SHRew, YRoveto, PMSun, DWang, XWang, YYan, XYu, MZhu, J Piperidinone derivatives as MDM2 inhibitors for the treatment of cancer US Patent US9593129 Publication Date 3/14/2017
 
E3 ubiquitin-protein ligase Mdm2 [1-188]
Name:E3 ubiquitin-protein ligase Mdm2 [1-188]
Type:n/a
Mol. Mass.:21319.18
Organism:Homo sapiens (Human)
Description:Q00987[1-188]
Residue:188
BDBM299604
NameBDBM299604
Synonyms:2-((3R,5R,6S)-5-(3-chlorophenyl)-6-(4-chlorophenyl)-1-((S)-1-cyclopropyl-2-(N-(pyridin-3-yl)methylsulfonamido)ethyl)-3-methyl-2-oxopiperidin-3-yl)acetic acid | US9593129, Example 282
TypeSmall organic molecule
Emp. Form.C31H33Cl2N3O5S
Mol. Mass.630.582
SMILESC[C@]1(CC(O)=O)CC([C@H](N([C@H](CN(c2cccnc2)S(C)(=O)=O)C2CC2)C1=O)c1ccc(Cl)cc1)c1cccc(Cl)c1