Reaction Details
TargetNuclear receptor ROR-gamma
LigandBDBM317956
Substrate/Competitorn/a
Meas. Tech.RORgammat 5xRORE Assay in Jurkat Cells (Assay 2)
IC50>1000±n/a nM
Citation Claremon, DADillard, LWDong, CFan, YJia, LLiu, ZLotesta, SDMarcus, ASingh, SBTice, CMYuan, JZhao, WZheng, YZhuang, L Dihydropyrrolopyridine inhibitors of ROR-gamma US Patent US10807980 Publication Date 10/20/2020
 
Nuclear receptor ROR-gamma
Name:Nuclear receptor ROR-gamma
Type:Enzyme Catalytic Domain
Mol. Mass.:58218.40
Organism:Homo sapiens (Human)
Description:P51449
Residue:518
BDBM317956
NameBDBM317956
Synonyms:US10399976, Compound 109 US11535614, Compound 109 | US9624217, Compound 109
TypeSmall organic molecule
Emp. Form.C27H35F3N4O3S
Mol. Mass.552.652
SMILESCCS(=O)(=O)N1CCC(CNC(=O)c2cnc3[C@H](C(C)C)N(Cc4ccc(cc4)C(F)(F)F)Cc3c2)CC1