Reaction Details
TargetTyrosine-protein kinase BTK
LigandBDBM303645
Substrate/Competitorn/a
Meas. Tech.BTK Assay
IC50 2.00±n/a nM
Citation Bentzien, JBerry, AKBosanac, TBurke, MJDisalvo, DTHoran, JCLiang, SMao, CMao, WShen, YSoleymanzadeh, FZindell, RM Heteroaromatic compounds as BTK inhibitors US Patent US10875852 Publication Date 12/29/2020
 
Tyrosine-protein kinase BTK
Name:Tyrosine-protein kinase BTK
Type:Enzyme
Mol. Mass.:76289.95
Organism:Homo sapiens (Human)
Description:Q06187
Residue:659
BDBM303645
NameBDBM303645
Synonyms:US10138229, Example 157 | US10875852, Example 157
TypeSmall organic molecule
Emp. Form.C24H27N5O3
Mol. Mass.433.5029
SMILESCC#CC(=O)N1CC[C@@]2(C[C@@H](C2)n2nc(c(C(N)=O)c2N)-c2ccc(OC3CC3)cc2)C1