Reaction Details
TargetIntegrin alpha-5/beta-1 [T112H]
LigandBDBM300949
Substrate/Competitorn/a
Meas. Tech.Cell Adhesion Assay
IC50<10±n/a nM
Citation DeGrado, WFSheppard, DJo, HReed, NITang, Y Anti-alphavbeta1 integrin compounds and methods US Patent US10131658 Publication Date 11/20/2018
 
Integrin alpha-5/beta-1 [T112H]
Name:Integrin alpha-5/beta-1 [T112H]
Synonyms:Integrin alpha5beta1
Type:Protein Complex
Mol. Mass.:n/a
Description:Transfected K562 cell.
Components:This complex has 2 components.
Component 1
Name:Integrin beta-1 [T112H]
Type:Membrane Protein
Mol. Mass.:88450.95
Organism:Homo sapiens (Human)
Description:P05556[T112H]
Residue:798
Component 2
Name:Integrin alpha-5
Synonyms:CD49 antigen-like family member E FNRA Fibronectin receptor subunit alpha ITGA5 Integrin alpha-F | VLA-5
Type:Single-pass type I membrane protein
Mol. Mass.:114523.00
Organism:Homo sapiens (Human)
Description:n/a
Residue:1049
BDBM300949
NameBDBM300949
Synonyms:US10131658, Compound 215
TypeSmall organic molecule
Emp. Form.C32H41N7O6S
Mol. Mass.651.776
SMILESCN(C)c1cccc2c(cccc12)S(=O)(=O)N1CCCC1C(=O)N[C@@H](Cc1ccc(NC(=O)CCCCNC(N)=N)cc1)C(O)=O