Reaction Details
TargetTyrosine-protein kinase Fyn
LigandBDBM340146
Substrate/Competitorn/a
Meas. Tech.Enzyme Activity Assay
EC50>1000±n/a nM
Citation Barf, TAJans, CGde Man, APOubrie, AARaaijmakers, HCRewinkel, JBSterrenburg, JGWijkmans, JC 4-imidazopyridazin-1-yl-benzamides as Btk inhibitors US Patent US10934296 Publication Date 3/2/2021
 
Tyrosine-protein kinase Fyn
Name:Tyrosine-protein kinase Fyn
Type:Enzyme
Mol. Mass.:60762.21
Organism:Homo sapiens (Human)
Description:P06241
Residue:537
BDBM340146
NameBDBM340146
Synonyms:US10239883, Example 35 US9758524, Example 35
TypeSmall organic molecule
Emp. Form.C28H25N7O2
Mol. Mass.491.5438
SMILESNc1nccn2c(nc(-c3ccc(cc3)C(=O)Nc3ccccn3)c12)[C@@H]1CCCN1C(=O)C#CC1CC1