BDBM106778 7‐hydroxy‐8‐methyl‐3‐(4‐methylphenyl)‐4H‐chromen‐4‐ one::7-Hydroxy-8,4′-dimethyl-isoflavone (2b)::IR-203
SMILES: Cc1ccc(cc1)-c1coc2c(C)c(O)ccc2c1=O
InChI Key: InChIKey=XVHOBANISMPTNW-UHFFFAOYSA-N
Data: 3 IC50
Activity Spreadsheet -- Enzyme Inhibition Constant Data from BindingDB
Found 3 hits for monomerid = 106778
Trg + Lig
Ki
nM
ΔG°
kcal/mole
IC50
nM
Kd
nM
EC50/IC50
nM
koff
s-1
kon
M-1s-1
pHTemp
°C
12-Lipoxygenase (12-LOX)
(Homo sapiens (Human))
BDBM106778
(7‐hydroxy‐8‐methyl‐3‐...)
Show SMILES Cc1ccc(cc1)-c1coc2c(C)c(O)ccc2c1=O
Show InChI InChI=1S/C17H14O3/c1-10-3-5-12(6-4-10)14-9-20-17-11(2)15(18)8-7-13(17)16(14)19/h3-9,18H,1-2H3
n/an/a>1.00E+5n/an/an/an/a8.023
Universidad de Santiago de Chile
Assay Description
All reactions were carried in a volume of 2 mL stirred at 23°C with approximately 2.040 Units of 12-hLOX, 4.200 Units of 15-hLOX-1, and 6.600 Un...
Chem Biol Drug Des 82: 317-25 (2013)
Article DOI: 10.1111/cbdd.12157
BindingDB Entry DOI: 10.7270/Q2PZ57F3
Arachidonate 5-lipoxygenase
(Homo sapiens (Human))
BDBM106778
(7‐hydroxy‐8‐methyl‐3‐...)
Show SMILES Cc1ccc(cc1)-c1coc2c(C)c(O)ccc2c1=O
Show InChI InChI=1S/C17H14O3/c1-10-3-5-12(6-4-10)14-9-20-17-11(2)15(18)8-7-13(17)16(14)19/h3-9,18H,1-2H3
Reactome pathway
n/an/a 1.50E+3n/an/an/an/a7.325
Universidad de Santiago
Assay Description
The reactions were done in a volume of 2 mL and constantly stirred using a magnetic stir bar at room temperature (23 °C). Reactions with the crude, a...
Chem Biol Drug Des 86: 114-21 (2015)
Article DOI: 10.1111/cbdd.12469
BindingDB Entry DOI: 10.7270/Q2PZ57JF
Arachidonate 15-lipoxygenase
(Homo sapiens (Human))
BDBM106778
(7‐hydroxy‐8‐methyl‐3‐...)
Show SMILES Cc1ccc(cc1)-c1coc2c(C)c(O)ccc2c1=O
Show InChI InChI=1S/C17H14O3/c1-10-3-5-12(6-4-10)14-9-20-17-11(2)15(18)8-7-13(17)16(14)19/h3-9,18H,1-2H3
Reactome pathway
n/an/a>1.00E+5n/an/an/an/a7.523
Universidad de Santiago de Chile
Assay Description
All reactions were carried in a volume of 2 mL stirred at 23°C with approximately 2.040 Units of 12-hLOX, 4.200 Units of 15-hLOX-1, and 6.600 Un...
Chem Biol Drug Des 82: 317-25 (2013)
Article DOI: 10.1111/cbdd.12157
BindingDB Entry DOI: 10.7270/Q2PZ57F3