BDBM123115 (R)-2-((4-((5-(tert-butyl)-1-methyl-1H-pyrazol-3-yl)amino)-1H-pyrazolo[3,4-d]pyrimidin-6-yl)amino)-2-(pyridin-2-yl)ethanol (14)
SMILES: Cn1nc(Nc2nc(N[C@@H](CO)c3ccccn3)nc3n[nH]cc23)cc1C(C)(C)C
InChI Key: InChIKey=IQXMBYIANGCMSO-AWEZNQCLSA-N
Data: 2 IC50
Activity Spreadsheet -- Enzyme Inhibition Constant Data from BindingDB
Found 2 hits for monomerid = 123115
Trg + Lig
Ki
nM
ΔG°
kcal/mole
IC50
nM
Kd
nM
EC50/IC50
nM
koff
s-1
kon
M-1s-1
pHTemp
°C
MurC
(Escherichia coli)
BDBM123115
((R)-2-((4-((5-(tert-butyl)-1-methyl-1H-pyrazol-3-y...)
Show SMILES Cn1nc(Nc2nc(N[C@@H](CO)c3ccccn3)nc3n[nH]cc23)cc1C(C)(C)C
Show InChI InChI=1S/C20H25N9O/c1-20(2,3)15-9-16(28-29(15)4)24-17-12-10-22-27-18(12)26-19(25-17)23-14(11-30)13-7-5-6-8-21-13/h5-10,14,30H,11H2,1-4H3,(H3,22,23,24,25,26,27,28)/t14-/m0/s1
n/an/a 40n/an/an/an/an/a25
AstraZeneca India Pvt. Ltd.
Assay Description
The reactions (25 μL) were carried out in 25 mM Tris-HCl pH 8.0, 10 mM ammonium sulfate, 1.25 mM DTT, 0.002% Brij-35, 10 mM MgCl2, 40 μM UN...
ACS Chem Biol 9: 2274-82 (2014)
Article DOI: 10.1021/cb500360c
BindingDB Entry DOI: 10.7270/Q2KS6Q7X
MurC (P. aeruginosa)
(Pseudomonas aeruginosa (G-proteobacteria))
BDBM123115
((R)-2-((4-((5-(tert-butyl)-1-methyl-1H-pyrazol-3-y...)
Show SMILES Cn1nc(Nc2nc(N[C@@H](CO)c3ccccn3)nc3n[nH]cc23)cc1C(C)(C)C
Show InChI InChI=1S/C20H25N9O/c1-20(2,3)15-9-16(28-29(15)4)24-17-12-10-22-27-18(12)26-19(25-17)23-14(11-30)13-7-5-6-8-21-13/h5-10,14,30H,11H2,1-4H3,(H3,22,23,24,25,26,27,28)/t14-/m0/s1
n/an/a 8n/an/an/an/an/a25
AstraZeneca India Pvt. Ltd.
Assay Description
The reactions (50 μL) were carried out in 50 mM Tris-HCl pH 8.0, 20 mM ammonium sulfate, 2.5 mM DTT, 0.002% Brij-35, 1 mM MgCl2, 18 μM UNAM...
ACS Chem Biol 9: 2274-82 (2014)
Article DOI: 10.1021/cb500360c
BindingDB Entry DOI: 10.7270/Q2KS6Q7X