BDBM152698 (S)-2-Amino-5-formimidamidopentanoic acid (7)
SMILES: N[C@@H](CCCNC=N)C(O)=O
InChI Key: InChIKey=NYSVAXMPMBUVHF-YFKPBYRVSA-N
Data: 1 KI  1 IC50
PDB links: 1 PDB ID matches this monomer.
Activity Spreadsheet -- Enzyme Inhibition Constant Data from BindingDB
Found 1 hit for monomerid = 152698
Trg + Lig
Ki
nM
ΔG°
kcal/mole
IC50
nM
Kd
nM
EC50/IC50
nM
koff
s-1
kon
M-1s-1
pHTemp
°C
Nitric Oxide Synthase, inducible
(Mus musculus (mouse))
BDBM152698
((S)-2-Amino-5-formimidamidopentanoic acid (7))
Show SMILES N[C@@H](CCCNC=N)C(O)=O |r|
Show InChI InChI=1S/C6H13N3O2/c7-4-9-3-1-2-5(8)6(10)11/h4-5H,1-3,8H2,(H2,7,9)(H,10,11)/t5-/m0/s1
Reactome pathway
180n/a 400n/an/an/an/a7.4n/a
Northwestern University
Assay Description
The assay mixture contained L-arginine (10 μM), NADPH (100 μM), oxyhemoglobin (0.125 mg/mL), tetrahydrobiopterin (10 μM), and differen...
Biochemistry 54: 2530-8 (2015)
Article DOI: 10.1021/acs.biochem.5b00135
BindingDB Entry DOI: 10.7270/Q23B5XWQ