null
SMILES: Cn1c(-c2ccccc2)c2cc(N)ccc2c2ccc(=[NH2+])cc12
InChI Key: InChIKey=MRYUEHRAIMRPNB-UHFFFAOYSA-O
Activity Spreadsheet -- Enzyme Inhibition Constant Data from BindingDB
Found 6 hits for monomerid = 18
Trg + Lig
Ki
nM
ΔG°
kcal/mole
IC50
nM
Kd
nM
EC50/IC50
nM
koff
s-1
kon
M-1s-1
pHTemp
°C
Caspase-9
(Homo sapiens (Human))
BDBM18
((3-amino-5-methyl-6-phenyl-phenanthridin-5-ium-8-y...)
Show SMILES Cn1c(-c2ccccc2)c2cc(N)ccc2c2ccc(=[NH2+])cc12
Show InChI InChI=1S/C20H17N3/c1-23-19-12-15(22)8-10-17(19)16-9-7-14(21)11-18(16)20(23)13-5-3-2-4-6-13/h2-12,22H,21H2,1H3/p+1
NCI pathway
Reactome pathway
PCBioAssay
n/an/a 7.89E+3n/an/an/an/an/an/a
Burnham Center for Chemical Genomics
Curated by PubChem BioAssay
Assay Description
Data Source: Sanford-Burnham Center for Chemical Genomics (SBCCG) Source Affiliation: Sanford-Burnham Medical Research Institute (SBIMR, San Diego, C...
PubChem Bioassay (2011)
BindingDB Entry DOI: 10.7270/Q25M647F
Apoptotic protease-activating factor 1
(Homo sapiens (Human))
BDBM18
((3-amino-5-methyl-6-phenyl-phenanthridin-5-ium-8-y...)
Show SMILES Cn1c(-c2ccccc2)c2cc(N)ccc2c2ccc(=[NH2+])cc12
Show InChI InChI=1S/C20H17N3/c1-23-19-12-15(22)8-10-17(19)16-9-7-14(21)11-18(16)20(23)13-5-3-2-4-6-13/h2-12,22H,21H2,1H3/p+1
Reactome pathway
PCBioAssay
n/an/a 2.45E+4n/an/an/an/an/an/a
Burnham Center for Chemical Genomics
Curated by PubChem BioAssay
Assay Description
Data Source: Sanford-Burnham Center for Chemical Genomics (SBCCG) Source Affiliation: Sanford-Burnham Medical Research Institute (SBIMR, San Diego, C...
PubChem Bioassay (2011)
BindingDB Entry DOI: 10.7270/Q2JS9NZB
Apoptotic protease-activating factor 1
(Homo sapiens (Human))
BDBM18
((3-amino-5-methyl-6-phenyl-phenanthridin-5-ium-8-y...)
Show SMILES Cn1c(-c2ccccc2)c2cc(N)ccc2c2ccc(=[NH2+])cc12
Show InChI InChI=1S/C20H17N3/c1-23-19-12-15(22)8-10-17(19)16-9-7-14(21)11-18(16)20(23)13-5-3-2-4-6-13/h2-12,22H,21H2,1H3/p+1
Reactome pathway
PCBioAssay
n/an/a>1.00E+5n/an/an/an/an/an/a
Burnham Center for Chemical Genomics
Curated by PubChem BioAssay
Assay Description
Data Source: Sanford-Burnham Center for Chemical Genomics (SBCCG) Source Affiliation: Sanford-Burnham Medical Research Institute (SBIMR, San Diego, C...
PubChem Bioassay (2011)
BindingDB Entry DOI: 10.7270/Q2F18X8S
Zinc finger protein mex-5
(Caenorhabditis elegans)
BDBM18
((3-amino-5-methyl-6-phenyl-phenanthridin-5-ium-8-y...)
Show SMILES Cn1c(-c2ccccc2)c2cc(N)ccc2c2ccc(=[NH2+])cc12
Show InChI InChI=1S/C20H17N3/c1-23-19-12-15(22)8-10-17(19)16-9-7-14(21)11-18(16)20(23)13-5-3-2-4-6-13/h2-12,22H,21H2,1H3/p+1
PCBioAssay
n/an/an/an/a 5.36E+3n/an/an/an/a
Broad Institute
Curated by PubChem BioAssay
Assay Description
Broad Institute: MLPCN maternal gene expression Project ID: 2024 Keywords: Zinc finger, C. elegans, maternal gene expression, RNA-protein interac...
PubChem Bioassay (2009)
BindingDB Entry DOI: 10.7270/Q2D798VP
POsterior Segregation
(Caenorhabditis elegans)
BDBM18
((3-amino-5-methyl-6-phenyl-phenanthridin-5-ium-8-y...)
Show SMILES Cn1c(-c2ccccc2)c2cc(N)ccc2c2ccc(=[NH2+])cc12
Show InChI InChI=1S/C20H17N3/c1-23-19-12-15(22)8-10-17(19)16-9-7-14(21)11-18(16)20(23)13-5-3-2-4-6-13/h2-12,22H,21H2,1H3/p+1
PCBioAssay
n/an/an/an/a 1.35E+4n/an/an/an/a
Broad Institute
Curated by PubChem BioAssay
Assay Description
Broad Institute: MLPCN maternal gene expression Project ID: 2024 Keywords: Zinc finger, C. elegans, maternal gene expression, RNA-protein interac...
PubChem Bioassay (2009)
BindingDB Entry DOI: 10.7270/Q28G8J4C
Streptokinase A
(Streptococcus pyogenes M1 GAS)
BDBM18
((3-amino-5-methyl-6-phenyl-phenanthridin-5-ium-8-y...)
Show SMILES Cn1c(-c2ccccc2)c2cc(N)ccc2c2ccc(=[NH2+])cc12
Show InChI InChI=1S/C20H17N3/c1-23-19-12-15(22)8-10-17(19)16-9-7-14(21)11-18(16)20(23)13-5-3-2-4-6-13/h2-12,22H,21H2,1H3/p+1
PCBioAssay
n/an/an/an/a 1.50E+5n/an/an/an/a
Broad Institute
Curated by PubChem BioAssay
Assay Description
Keywords: Group A streptococcus, GAS, streptokinase, expression, virulence, inhibition, dose response, EC50 Assay Overview: The goal of this assa...
PubChem Bioassay (2009)
BindingDB Entry DOI: 10.7270/Q2736PBV
Activity Spreadsheet -- ITC Data from BindingDB
Found 2 hits for monomerid = 18
Cell (A)Syringe (B)Cell
Syringe
Cell + Syr
ΔG°
kcal/mole
-TΔS°
kcal/mole
ΔH°
kcal/mole
log KpHTemp
°C
H1/H5-depleted chromatin
(Homo sapiens (Human))
BDBM18
JPEG
((3-amino-5-methyl-6-phenyl-phenanthridin-5-ium-8-y...)
-6.621.47-8.134.937.520
Universite de Liege
Biochemistry 37: 9119-26 (1998)
DNA(calf thymus)
(Bos taurus (bovine))
BDBM18
JPEG
((3-amino-5-methyl-6-phenyl-phenanthridin-5-ium-8-y...)
-7.020.441-7.425.207.520
Universite de Liege
Biochemistry 37: 9119-26 (1998)