BDBM185588 US9156852, 59::USRE47451, Example 59
SMILES: CN(C)Cc1cc(Nc2nccc3c(NC(=O)c4csc5c(N)ncnc45)c(C)ccc23)ccc1Cl
InChI Key: InChIKey=SLCWKPNWOMBQAA-UHFFFAOYSA-N
Data: 6 IC50
Activity Spreadsheet -- Enzyme Inhibition Constant Data from BindingDB
Found 6 hits for monomerid = 185588
Trg + Lig
Ki
nM
ΔG°
kcal/mole
IC50
nM
Kd
nM
EC50/IC50
nM
koff
s-1
kon
M-1s-1
pHTemp
°C
Serine/threonine-protein kinase B-raf
(Homo sapiens (Human))
BDBM185588
(US9156852, 59 | USRE47451, Example 59)
Show SMILES CN(C)Cc1cc(Nc2nccc3c(NC(=O)c4csc5c(N)ncnc45)c(C)ccc23)ccc1Cl
Show InChI InChI=1S/C26H24ClN7OS/c1-14-4-6-18-17(21(14)33-26(35)19-12-36-23-22(19)30-13-31-24(23)28)8-9-29-25(18)32-16-5-7-20(27)15(10-16)11-34(2)3/h4-10,12-13H,11H2,1-3H3,(H,29,32)(H,33,35)(H2,28,30,31)
NCI pathway
Reactome pathway
US Patent
n/an/a 42n/an/an/an/an/an/a
HANMI PHARM. CO., LTD
US Patent
Assay Description
The compounds prepared in Examples were tested for inhibitory activity against three subtypes of RAF, i.e., RAF1 Y340D Y341D (C-RAF), B-RAF normal ty...
US Patent US9156852 (2015)
BindingDB Entry DOI: 10.7270/Q24T6H4D
Serine/threonine-protein kinase B-raf [V600E]
(Homo sapiens (Human))
BDBM185588
(US9156852, 59 | USRE47451, Example 59)
Show SMILES CN(C)Cc1cc(Nc2nccc3c(NC(=O)c4csc5c(N)ncnc45)c(C)ccc23)ccc1Cl
Show InChI InChI=1S/C26H24ClN7OS/c1-14-4-6-18-17(21(14)33-26(35)19-12-36-23-22(19)30-13-31-24(23)28)8-9-29-25(18)32-16-5-7-20(27)15(10-16)11-34(2)3/h4-10,12-13H,11H2,1-3H3,(H,29,32)(H,33,35)(H2,28,30,31)
US Patent
n/an/a 7n/an/an/an/an/an/a
HANMI PHARM. CO., LTD
US Patent
Assay Description
The compounds prepared in Examples were tested for inhibitory activity against three subtypes of RAF, i.e., RAF1 Y340D Y341D (C-RAF), B-RAF normal ty...
US Patent US9156852 (2015)
BindingDB Entry DOI: 10.7270/Q24T6H4D
RAF proto-oncogene serine/threonine-protein kinase [Y340D,Y341D]
(Homo sapiens (Human))
BDBM185588
(US9156852, 59 | USRE47451, Example 59)
Show SMILES CN(C)Cc1cc(Nc2nccc3c(NC(=O)c4csc5c(N)ncnc45)c(C)ccc23)ccc1Cl
Show InChI InChI=1S/C26H24ClN7OS/c1-14-4-6-18-17(21(14)33-26(35)19-12-36-23-22(19)30-13-31-24(23)28)8-9-29-25(18)32-16-5-7-20(27)15(10-16)11-34(2)3/h4-10,12-13H,11H2,1-3H3,(H,29,32)(H,33,35)(H2,28,30,31)
US Patent
n/an/a 6n/an/an/an/an/an/a
SRMLSC
Curated by PubChem BioAssay
Assay Description
The compounds prepared in Examples were tested for inhibitory activity against three subtypes of RAF, i.e., RAF1 Y340D Y341D (C-RAF), B-RAF normal ty...
PubChem Bioassay (2006)
BindingDB Entry DOI: 10.7270/Q2XW4N61
Serine/threonine-protein kinase B-raf [409-765]
(Homo sapiens (Human))
BDBM185588
(US9156852, 59 | USRE47451, Example 59)
Show SMILES CN(C)Cc1cc(Nc2nccc3c(NC(=O)c4csc5c(N)ncnc45)c(C)ccc23)ccc1Cl
Show InChI InChI=1S/C26H24ClN7OS/c1-14-4-6-18-17(21(14)33-26(35)19-12-36-23-22(19)30-13-31-24(23)28)8-9-29-25(18)32-16-5-7-20(27)15(10-16)11-34(2)3/h4-10,12-13H,11H2,1-3H3,(H,29,32)(H,33,35)(H2,28,30,31)
Reactome pathway
US Patent
n/an/a 42n/an/an/an/an/an/a
SRMLSC
Curated by PubChem BioAssay
Assay Description
The compounds prepared in Examples were tested for inhibitory activity against three subtypes of RAF, i.e., RAF1 Y340D Y341D (C-RAF), B-RAF normal ty...
PubChem Bioassay (2006)
BindingDB Entry DOI: 10.7270/Q2XW4N61
Serine/threonine-protein kinase B-raf [V600E]
(Homo sapiens (Human))
BDBM185588
(US9156852, 59 | USRE47451, Example 59)
Show SMILES CN(C)Cc1cc(Nc2nccc3c(NC(=O)c4csc5c(N)ncnc45)c(C)ccc23)ccc1Cl
Show InChI InChI=1S/C26H24ClN7OS/c1-14-4-6-18-17(21(14)33-26(35)19-12-36-23-22(19)30-13-31-24(23)28)8-9-29-25(18)32-16-5-7-20(27)15(10-16)11-34(2)3/h4-10,12-13H,11H2,1-3H3,(H,29,32)(H,33,35)(H2,28,30,31)
US Patent
n/an/a 7n/an/an/an/an/an/a
SRMLSC
Curated by PubChem BioAssay
Assay Description
The compounds prepared in Examples were tested for inhibitory activity against three subtypes of RAF, i.e., RAF1 Y340D Y341D (C-RAF), B-RAF normal ty...
PubChem Bioassay (2006)
BindingDB Entry DOI: 10.7270/Q2XW4N61
RAF proto-oncogene serine/threonine-protein kinase
(Homo sapiens (Human))
BDBM185588
(US9156852, 59 | USRE47451, Example 59)
Show SMILES CN(C)Cc1cc(Nc2nccc3c(NC(=O)c4csc5c(N)ncnc45)c(C)ccc23)ccc1Cl
Show InChI InChI=1S/C26H24ClN7OS/c1-14-4-6-18-17(21(14)33-26(35)19-12-36-23-22(19)30-13-31-24(23)28)8-9-29-25(18)32-16-5-7-20(27)15(10-16)11-34(2)3/h4-10,12-13H,11H2,1-3H3,(H,29,32)(H,33,35)(H2,28,30,31)
NCI pathway
Reactome pathway
US Patent
n/an/a 6n/an/an/an/an/an/a
HANMI PHARM. CO., LTD
US Patent
Assay Description
The compounds prepared in Examples were tested for inhibitory activity against three subtypes of RAF, i.e., RAF1 Y340D Y341D (C-RAF), B-RAF normal ty...
US Patent US9156852 (2015)
BindingDB Entry DOI: 10.7270/Q24T6H4D