BDBM194501 US9200020, Table 3 compound 10
SMILES: Nc1nc2n(CCN(CCO)CCP(O)(O)=O)c[nH]c2c(=O)[nH]1
InChI Key: InChIKey=FXQJTLAGCQCBDH-UHFFFAOYSA-N
Data: 3 KI
Activity Spreadsheet -- Enzyme Inhibition Constant Data from BindingDB
Found 3 hits for monomerid = 194501
Trg + Lig
Ki
nM
ΔG°
kcal/mole
IC50
nM
Kd
nM
EC50/IC50
nM
koff
s-1
kon
M-1s-1
pHTemp
°C
Hypoxanthine-guanine phosphoribosyltransferase (HGPRT)
(Homo sapiens (Human))
BDBM194501
(US9200020, Table 3 compound 10)
Show SMILES Nc1nc2n(CCN(CCO)CCP(O)(O)=O)c[nH]c2c(=O)[nH]1
Show InChI InChI=1S/C7H19BNO4P/c8-2-4-9(5-6-10)3-1-7-14(11,12)13/h10H,1-8H2,(H2,11,12,13)
Reactome pathway
US Patent
70n/an/an/an/an/an/a7.4n/a
THE UNIVERSITY OF QUEENSLAND; INSTITUTE OF ORGANIC CHEMISTRY AND BIOCHEMISTRY ASCR, V.V.I.
US Patent
Assay Description
The Ki values were determined using a spectrophotometric assay at 25° C., 0.1 M Tris-HCl, 10 mM MgCl2, pH 7.4 (Keough, D. T.; Ng, A. L.; Winzor, D. J...
US Patent US9200020 (2015)
BindingDB Entry DOI: 10.7270/Q2TM78XB
Hypoxanthine-guanine-xanthine phosphoribosyltransferase (PfHGXPRT)
(Plasmodium falciparum)
BDBM194501
(US9200020, Table 3 compound 10)
Show SMILES Nc1nc2n(CCN(CCO)CCP(O)(O)=O)c[nH]c2c(=O)[nH]1
Show InChI InChI=1S/C7H19BNO4P/c8-2-4-9(5-6-10)3-1-7-14(11,12)13/h10H,1-8H2,(H2,11,12,13)
US Patent
200n/an/an/an/an/an/a7.4n/a
THE UNIVERSITY OF QUEENSLAND; INSTITUTE OF ORGANIC CHEMISTRY AND BIOCHEMISTRY ASCR, V.V.I.
US Patent
Assay Description
The Ki values were determined using a spectrophotometric assay at 25° C., 0.1 M Tris-HCl, 10 mM MgCl2, pH 7.4 (Keough, D. T.; Ng, A. L.; Winzor, D. J...
US Patent US9200020 (2015)
BindingDB Entry DOI: 10.7270/Q2TM78XB
Hypoxanthine-guanine phosphoribosyltransferase (HGPRT)
(Plasmodium vivax)
BDBM194501
(US9200020, Table 3 compound 10)
Show SMILES Nc1nc2n(CCN(CCO)CCP(O)(O)=O)c[nH]c2c(=O)[nH]1
Show InChI InChI=1S/C7H19BNO4P/c8-2-4-9(5-6-10)3-1-7-14(11,12)13/h10H,1-8H2,(H2,11,12,13)
US Patent
1.40E+3n/an/an/an/an/an/a7.4n/a
THE UNIVERSITY OF QUEENSLAND; INSTITUTE OF ORGANIC CHEMISTRY AND BIOCHEMISTRY ASCR, V.V.I.
US Patent
Assay Description
The Ki values were determined using a spectrophotometric assay at 25° C., 0.1 M Tris-HCl, 10 mM MgCl2, pH 7.4 (Keough, D. T.; Ng, A. L.; Winzor, D. J...
US Patent US9200020 (2015)
BindingDB Entry DOI: 10.7270/Q2TM78XB