BDBM24926 1-(3-chlorophenyl)-3-methyl-N-[(1S)-1-phenylethyl]-1H-pyrazolo[4,3-c]pyridin-6-amine::BMCL185648 Compound 15::pyrazolopyridine-based compound, 2
SMILES: C[C@H](Nc1cc2n(nc(C)c2cn1)-c1cccc(Cl)c1)c1ccccc1
InChI Key: InChIKey=NTAIRXFACXVUQO-AWEZNQCLSA-N
Data: 2 IC50
PDB links: 1 PDB ID contains this monomer as substructures. 1 PDB ID contains inhibitors having a similarity of 90% to this monomer.
Activity Spreadsheet -- Enzyme Inhibition Constant Data from BindingDB
Found 2 hits for monomerid = 24926
Trg + Lig
Ki
nM
ΔG°
kcal/mole
IC50
nM
Kd
nM
EC50/IC50
nM
koff
s-1
kon
M-1s-1
pHTemp
°C
Serine/threonine-protein kinase PLK1
(Homo sapiens (Human))
BDBM24926
(1-(3-chlorophenyl)-3-methyl-N-[(1S)-1-phenylethyl]...)
Show SMILES C[C@H](Nc1cc2n(nc(C)c2cn1)-c1cccc(Cl)c1)c1ccccc1 |r|
Show InChI InChI=1S/C21H19ClN4/c1-14(16-7-4-3-5-8-16)24-21-12-20-19(13-23-21)15(2)25-26(20)18-10-6-9-17(22)11-18/h3-14H,1-2H3,(H,23,24)/t14-/m0/s1
NCI pathway
Reactome pathway
n/an/a 121n/an/an/an/a7.230
Sunesis Pharmaceuticals
Assay Description
An IMAP fluorescence polarization-based assay format (Molecular Devices) was used to determine the ability of compounds to inhibit the phosphorylatio...
Bioorg Med Chem Lett 18: 5186-9 (2008)
Article DOI: 10.1016/j.bmcl.2008.08.091
BindingDB Entry DOI: 10.7270/Q22Z13T8
Serine/threonine-protein kinase PLK1
(Homo sapiens (Human))
BDBM24926
(1-(3-chlorophenyl)-3-methyl-N-[(1S)-1-phenylethyl]...)
Show SMILES C[C@H](Nc1cc2n(nc(C)c2cn1)-c1cccc(Cl)c1)c1ccccc1 |r|
Show InChI InChI=1S/C21H19ClN4/c1-14(16-7-4-3-5-8-16)24-21-12-20-19(13-23-21)15(2)25-26(20)18-10-6-9-17(22)11-18/h3-14H,1-2H3,(H,23,24)/t14-/m0/s1
NCI pathway
Reactome pathway
n/an/a 121n/an/an/an/a7.230
Sunesis Pharmaceuticals
Assay Description
An IMAP fluorescence polarization-based assay format (Molecular Devices) was used to determine the ability of compounds to inhibit the phosphorylatio...
Bioorg Med Chem Lett 18: 5648-52 (2008)
Article DOI: 10.1016/j.bmcl.2008.08.095
BindingDB Entry DOI: 10.7270/Q29C6VRP