BDBM313657 (R)-N-(3-(2-(2,3- dihydroxypropoxy)-6- (tetrahydro-2H-pyran-4- yl)pyridin-4-yl)-4- methylphenyl)-4- (trifluoromethyl) picolinamide::US10167279, Example 283
SMILES: Cc1ccc(NC(=O)c2cc(ccn2)C(F)(F)F)cc1-c1cc(OC[C@H](O)CO)nc(c1)C1CCOCC1
InChI Key: InChIKey=LZLWKZRADXPBIE-OAQYLSRUSA-N
Data: 1 IC50
Activity Spreadsheet -- Enzyme Inhibition Constant Data from BindingDB
Found 1 hit for monomerid = 313657
Trg + Lig
Ki
nM
ΔG°
kcal/mole
IC50
nM
Kd
nM
EC50/IC50
nM
koff
s-1
kon
M-1s-1
pHTemp
°C
RAF proto-oncogene serine/threonine-protein kinase
(Homo sapiens (Human))
BDBM313657
((R)-N-(3-(2-(2,3- dihydroxypropoxy)-6- (tetrahydro...)
Show SMILES Cc1ccc(NC(=O)c2cc(ccn2)C(F)(F)F)cc1-c1cc(OC[C@H](O)CO)nc(c1)C1CCOCC1 |r|
Show InChI InChI=1S/C27H28F3N3O5/c1-16-2-3-20(32-26(36)24-12-19(4-7-31-24)27(28,29)30)13-22(16)18-10-23(17-5-8-37-9-6-17)33-25(11-18)38-15-21(35)14-34/h2-4,7,10-13,17,21,34-35H,5-6,8-9,14-15H2,1H3,(H,32,36)/t21-/m1/s1
NCI pathway
Reactome pathway
US Patent
n/an/a 70n/an/an/an/an/an/a
Novartis AG
US Patent
Assay Description
Assay Materials: Assay buffer is 50 mM Tris, pH 7.5, 15 mM MgCl2, 0.01% Bovine Serum Albumin (BSA) and 1 mM dithiothreitol (DTT); Stop buffer is 60 m...
US Patent US10167279 (2019)
BindingDB Entry DOI: 10.7270/Q2W0981V