BDBM36244 5,10,15-tris(3,5-dicarboxylatophenyl)-20-phenylporphyrin
SMILES: OC(=O)c1cc(cc(c1)-c1c2ccc(n2)c(-c2ccccc2)c2ccc(n2)c(-c2cc(cc(c2)C(O)=O)C(O)=O)c2ccc([nH]2)c(-c2cc(cc(c2)C(O)=O)C(O)=O)c2ccc1[nH]2)C(O)=O
InChI Key: InChIKey=FHMGTUVSRXMEOW-LWQDQPMZSA-N
Data: 7 ITC
Activity Spreadsheet -- ITC Data from BindingDB
Found 7 hits for monomerid = 36244
Cell (A)Syringe (B)Cell
Syringe
Cell + Syr
ΔG°
kcal/mole
-TΔS°
kcal/mole
ΔH°
kcal/mole
log KpHTemp
°C
BDBM4
JPEG
BDBM36244
JPEG
n/a10.5-12.71.52725
Doshisha University
J Org Chem 70: 3667-73 (2005)
BDBM11
JPEG
BDBM36244
JPEG
n/a-1.03-3.103.08725
Doshisha University
J Org Chem 70: 3667-73 (2005)
BDBM36245
JPEG
BDBM36244
JPEG
n/a-0.121-5.494.08725
Doshisha University
J Org Chem 70: 3667-73 (2005)
BDBM36246
JPEG
BDBM36244
JPEG
n/a2.63-12.26.93725
Doshisha University
J Org Chem 70: 3667-73 (2005)
BDBM36247
JPEG
BDBM36244
JPEG
n/a4.78-14.16.84725
Doshisha University
J Org Chem 70: 3667-73 (2005)
BDBM36126
JPEG
BDBM36244
JPEG
n/a7.62-11.52.81725
Doshisha University
J Org Chem 70: 3667-73 (2005)
BDBM36248
JPEG
BDBM36244
JPEG
n/a-0.406-5.734.46725
Doshisha University
J Org Chem 70: 3667-73 (2005)