BDBM37254 10-phenothiazinecarbothioic acid S-(5-methyl-1,3,4-thiadiazol-2-yl) ester::MLS000112617::S-(5-methyl-1,3,4-thiadiazol-2-yl) phenothiazine-10-carbothioate::SMR000108529::cid_1160939::phenothiazine-10-carbothioic acid S-(5-methyl-1,3,4-thiadiazol-2-yl) ester
SMILES: Cc1nnc(SC(=O)N2c3ccccc3Sc3ccccc23)s1
InChI Key: InChIKey=CCWBJWIPQQIPJH-UHFFFAOYSA-N
Data: 8 IC50  3 EC50
Activity Spreadsheet -- Enzyme Inhibition Constant Data from BindingDB
Found 11 hits for monomerid = 37254
Trg + Lig
Ki
nM
ΔG°
kcal/mole
IC50
nM
Kd
nM
EC50/IC50
nM
koff
s-1
kon
M-1s-1
pHTemp
°C
Huntingtin
(Homo sapiens (Human))
BDBM37254
(10-phenothiazinecarbothioic acid S-(5-methyl-1,3,4...)
Show SMILES Cc1nnc(SC(=O)N2c3ccccc3Sc3ccccc23)s1
Show InChI InChI=1S/C16H11N3OS3/c1-10-17-18-15(21-10)23-16(20)19-11-6-2-4-8-13(11)22-14-9-5-3-7-12(14)19/h2-9H,1H3
PCBioAssay
n/an/a>8.00E+3n/an/an/an/an/an/a
Columbia University Molecular Screening Center
Curated by PubChem BioAssay
Assay Description
The mutation underlying Huntington's disease is an expansion of a polyglutamine tract in the N-terminus of the protein huntingtin (htt). Under no...
PubChem Bioassay (2007)
BindingDB Entry DOI: 10.7270/Q2SQ8XSH
Sphingosine 1-phosphate receptor 1
(Homo sapiens (Human))
BDBM37254
(10-phenothiazinecarbothioic acid S-(5-methyl-1,3,4...)
Show SMILES Cc1nnc(SC(=O)N2c3ccccc3Sc3ccccc23)s1
Show InChI InChI=1S/C16H11N3OS3/c1-10-17-18-15(21-10)23-16(20)19-11-6-2-4-8-13(11)22-14-9-5-3-7-12(14)19/h2-9H,1H3
Reactome pathway
PCBioAssay
n/an/an/an/a 3.63E+3n/an/an/an/a
The Scripps Research Institute Molecular Screening Center
Curated by PubChem BioAssay
Assay Description
Source (MLSCN Center Name): The Scripps Research Institute Molecular Screening Center Center Affiliation: The Scripps Research Institute, TSRI Assay ...
PubChem Bioassay (2007)
BindingDB Entry DOI: 10.7270/Q2ZC817P
Sphingosine 1-phosphate receptor 1
(Homo sapiens (Human))
BDBM37254
(10-phenothiazinecarbothioic acid S-(5-methyl-1,3,4...)
Show SMILES Cc1nnc(SC(=O)N2c3ccccc3Sc3ccccc23)s1
Show InChI InChI=1S/C16H11N3OS3/c1-10-17-18-15(21-10)23-16(20)19-11-6-2-4-8-13(11)22-14-9-5-3-7-12(14)19/h2-9H,1H3
Reactome pathway
PCBioAssay
n/an/an/an/a 3.42E+3n/an/an/an/a
The Scripps Research Institute Molecular Screening Center
Curated by PubChem BioAssay
Assay Description
Source (MLSCN Center Name): The Scripps Research Institute Molecular Screening Center Center Affiliation: The Scripps Research Institute, TSRI Assay ...
PubChem Bioassay (2007)
BindingDB Entry DOI: 10.7270/Q25X2795
Sphingosine 1-phosphate receptor 1
(Homo sapiens (Human))
BDBM37254
(10-phenothiazinecarbothioic acid S-(5-methyl-1,3,4...)
Show SMILES Cc1nnc(SC(=O)N2c3ccccc3Sc3ccccc23)s1
Show InChI InChI=1S/C16H11N3OS3/c1-10-17-18-15(21-10)23-16(20)19-11-6-2-4-8-13(11)22-14-9-5-3-7-12(14)19/h2-9H,1H3
Reactome pathway
PCBioAssay
n/an/an/an/a 3.57E+3n/an/an/an/a
The Scripps Research Institute Molecular Screening Center
Curated by PubChem BioAssay
Assay Description
Source (MLSCN Center Name): The Scripps Research Institute Molecular Screening Center Center Affiliation: The Scripps Research Institute, TSRI Assay ...
PubChem Bioassay (2007)
BindingDB Entry DOI: 10.7270/Q2251GJ9
Steroidogenic Factor 1
(Homo sapiens (Human))
BDBM37254
(10-phenothiazinecarbothioic acid S-(5-methyl-1,3,4...)
Show SMILES Cc1nnc(SC(=O)N2c3ccccc3Sc3ccccc23)s1
Show InChI InChI=1S/C16H11N3OS3/c1-10-17-18-15(21-10)23-16(20)19-11-6-2-4-8-13(11)22-14-9-5-3-7-12(14)19/h2-9H,1H3
Reactome pathway
PCBioAssay
n/an/a 5.38E+3n/an/an/an/an/an/a
The Scripps Research Institute Molecular Screening Center
Curated by PubChem BioAssay
Assay Description
Source (MLSCN Center Name): The Scripps Research Institute Molecular Screening Center Center Affiliation: The Scripps Research Institute, TSRI Assay ...
PubChem Bioassay (2007)
BindingDB Entry DOI: 10.7270/Q2319T8T
nuclear receptor coactivator 3 isoform a
(Homo sapiens (Human))
BDBM37254
(10-phenothiazinecarbothioic acid S-(5-methyl-1,3,4...)
Show SMILES Cc1nnc(SC(=O)N2c3ccccc3Sc3ccccc23)s1
Show InChI InChI=1S/C16H11N3OS3/c1-10-17-18-15(21-10)23-16(20)19-11-6-2-4-8-13(11)22-14-9-5-3-7-12(14)19/h2-9H,1H3
Reactome pathway
PCBioAssay
n/an/a>3.98E+3n/an/an/an/an/an/a
The Scripps Research Institute Molecular Screening Center
Curated by PubChem BioAssay
Assay Description
Source (MLPCN Center Name): The Scripps Research Institute Molecular Screening Center (SRIMSC) Affiliation: The Scripps Research Institute, TSRI Assa...
PubChem Bioassay (2012)
BindingDB Entry DOI: 10.7270/Q2HT2MXV
Nuclear receptor ROR-alpha
(Homo sapiens (Human))
BDBM37254
(10-phenothiazinecarbothioic acid S-(5-methyl-1,3,4...)
Show SMILES Cc1nnc(SC(=O)N2c3ccccc3Sc3ccccc23)s1
Show InChI InChI=1S/C16H11N3OS3/c1-10-17-18-15(21-10)23-16(20)19-11-6-2-4-8-13(11)22-14-9-5-3-7-12(14)19/h2-9H,1H3
Reactome pathway
PCBioAssay
n/an/a 4.36E+3n/an/an/an/an/an/a
The Scripps Research Institute Molecular Screening Center
Curated by PubChem BioAssay
Assay Description
Source (MLSCN Center Name): The Scripps Research Institute Molecular Screening Center Center Affiliation: The Scripps Research Institute, TSRI Assay ...
PubChem Bioassay (2007)
BindingDB Entry DOI: 10.7270/Q2TH8K3N
Steroidogenic Factor 1
(Homo sapiens (Human))
BDBM37254
(10-phenothiazinecarbothioic acid S-(5-methyl-1,3,4...)
Show SMILES Cc1nnc(SC(=O)N2c3ccccc3Sc3ccccc23)s1
Show InChI InChI=1S/C16H11N3OS3/c1-10-17-18-15(21-10)23-16(20)19-11-6-2-4-8-13(11)22-14-9-5-3-7-12(14)19/h2-9H,1H3
Reactome pathway
PCBioAssay
n/an/a 6.07E+3n/an/an/an/an/an/a
The Scripps Research Institute Molecular Screening Center
Curated by PubChem BioAssay
Assay Description
Source (MLSCN Center Name): The Scripps Research Institute Molecular Screening Center Center Affiliation: The Scripps Research Institute, TSRI Assay ...
PubChem Bioassay (2007)
BindingDB Entry DOI: 10.7270/Q2PR7TCX
Nuclear receptor ROR-alpha
(Homo sapiens (Human))
BDBM37254
(10-phenothiazinecarbothioic acid S-(5-methyl-1,3,4...)
Show SMILES Cc1nnc(SC(=O)N2c3ccccc3Sc3ccccc23)s1
Show InChI InChI=1S/C16H11N3OS3/c1-10-17-18-15(21-10)23-16(20)19-11-6-2-4-8-13(11)22-14-9-5-3-7-12(14)19/h2-9H,1H3
Reactome pathway
PCBioAssay
n/an/a 4.06E+3n/an/an/an/an/an/a
The Scripps Research Institute Molecular Screening Center
Curated by PubChem BioAssay
Assay Description
Source (MLSCN Center Name): The Scripps Research Institute Molecular Screening Center Center Affiliation: The Scripps Research Institute, TSRI Assay ...
PubChem Bioassay (2007)
BindingDB Entry DOI: 10.7270/Q26Q1VNZ
3C-like protease
(Avian infectious bronchitis virus)
BDBM37254
(10-phenothiazinecarbothioic acid S-(5-methyl-1,3,4...)
Show SMILES Cc1nnc(SC(=O)N2c3ccccc3Sc3ccccc23)s1
Show InChI InChI=1S/C16H11N3OS3/c1-10-17-18-15(21-10)23-16(20)19-11-6-2-4-8-13(11)22-14-9-5-3-7-12(14)19/h2-9H,1H3
PCBioAssay
n/an/a 1.04E+4n/an/an/an/an/an/a
The Scripps Research Institute Molecular Screening Center
Curated by PubChem BioAssay
Assay Description
Source (MLPCN Center Name): The Scripps Research Institute Molecular Screening Center (SRIMSC) Center Affiliation: The Scripps Research Institute (TS...
PubChem Bioassay (2009)
BindingDB Entry DOI: 10.7270/Q29K48NM
Complement C1s
(Homo sapiens (Human))
BDBM37254
(10-phenothiazinecarbothioic acid S-(5-methyl-1,3,4...)
Show SMILES Cc1nnc(SC(=O)N2c3ccccc3Sc3ccccc23)s1
Show InChI InChI=1S/C16H11N3OS3/c1-10-17-18-15(21-10)23-16(20)19-11-6-2-4-8-13(11)22-14-9-5-3-7-12(14)19/h2-9H,1H3
Reactome pathway
PCBioAssay
n/an/a>5.00E+4n/an/an/an/an/an/a
PCMD
Curated by PubChem BioAssay
Assay Description
Molecular Library Screening Center Network (MLSCN) Penn Center for Molecular Discovery (PCMD) Assay Provider: Dr. Scott L. Diamond, University of Pen...
PubChem Bioassay (2008)
BindingDB Entry DOI: 10.7270/Q2MP51PC