BDBM50350771 CHEMBL1738740
SMILES: Nc1nc2sc3cccc(CNc4ccc5C(=O)N(Cc5c4)[C@@H](CCC(O)=O)C(O)=O)c3c2c(=O)[nH]1
InChI Key: InChIKey=QPDXRVRRCIFNSL-HNNXBMFYSA-N
Data: 5 IC50
PDB links: 1 PDB ID matches this monomer.
Activity Spreadsheet -- Enzyme Inhibition Constant Data from BindingDB
Found 5 hits for monomerid = 50350771
Trg + Lig
Ki
nM
ΔG°
kcal/mole
IC50
nM
Kd
nM
EC50/IC50
nM
koff
s-1
kon
M-1s-1
pHTemp
°C
Thymidylate synthase
(Homo sapiens (Human))
BDBM50350771
(CHEMBL1738740)
Show SMILES Nc1nc2sc3cccc(CNc4ccc5C(=O)N(Cc5c4)[C@@H](CCC(O)=O)C(O)=O)c3c2c(=O)[nH]1 |r|
Show InChI InChI=1S/C24H21N5O6S/c25-24-27-20(32)19-18-11(2-1-3-16(18)36-21(19)28-24)9-26-13-4-5-14-12(8-13)10-29(22(14)33)15(23(34)35)6-7-17(30)31/h1-5,8,15,26H,6-7,9-10H2,(H,30,31)(H,34,35)(H3,25,27,28,32)/t15-/m0/s1
NCI pathway
Reactome pathway
n/an/a 34n/an/an/an/an/an/a
Duquesne University
Curated by ChEMBL
Assay Description
Inhibition of human TS assessed as oxidation of tetrahydrofolate to dihydrofolate after 2 to 12 mins by spectrophotometry
Bioorg Med Chem 19: 3585-94 (2011)
Article DOI: 10.1016/j.bmc.2011.03.067
BindingDB Entry DOI: 10.7270/Q22V2GGP
Thymidylate synthase (EC 2.1.1.45) (TS) (TSase)
(Escherichia coli)
BDBM50350771
(CHEMBL1738740)
Show SMILES Nc1nc2sc3cccc(CNc4ccc5C(=O)N(Cc5c4)[C@@H](CCC(O)=O)C(O)=O)c3c2c(=O)[nH]1 |r|
Show InChI InChI=1S/C24H21N5O6S/c25-24-27-20(32)19-18-11(2-1-3-16(18)36-21(19)28-24)9-26-13-4-5-14-12(8-13)10-29(22(14)33)15(23(34)35)6-7-17(30)31/h1-5,8,15,26H,6-7,9-10H2,(H,30,31)(H,34,35)(H3,25,27,28,32)/t15-/m0/s1
n/an/a 50n/an/an/an/an/an/a
Duquesne University
Curated by ChEMBL
Assay Description
Inhibition of Escherichia coli TS assessed as oxidation of tetrahydrofolate to dihydrofolate after 2 to 12 mins by spectrophotometry
Bioorg Med Chem 19: 3585-94 (2011)
Article DOI: 10.1016/j.bmc.2011.03.067
BindingDB Entry DOI: 10.7270/Q22V2GGP
Dihydrofolate reductase (DHFR)
(Toxoplasma gondii)
BDBM50350771
(CHEMBL1738740)
Show SMILES Nc1nc2sc3cccc(CNc4ccc5C(=O)N(Cc5c4)[C@@H](CCC(O)=O)C(O)=O)c3c2c(=O)[nH]1 |r|
Show InChI InChI=1S/C24H21N5O6S/c25-24-27-20(32)19-18-11(2-1-3-16(18)36-21(19)28-24)9-26-13-4-5-14-12(8-13)10-29(22(14)33)15(23(34)35)6-7-17(30)31/h1-5,8,15,26H,6-7,9-10H2,(H,30,31)(H,34,35)(H3,25,27,28,32)/t15-/m0/s1
n/an/a 10n/an/an/an/an/an/a
Duquesne University
Curated by ChEMBL
Assay Description
Inhibition of Toxoplasma gondii DHFR by spectrophotometry
Bioorg Med Chem 19: 3585-94 (2011)
Article DOI: 10.1016/j.bmc.2011.03.067
BindingDB Entry DOI: 10.7270/Q22V2GGP
Dihydrofolate reductase
(Homo sapiens (Human))
BDBM50350771
(CHEMBL1738740)
Show SMILES Nc1nc2sc3cccc(CNc4ccc5C(=O)N(Cc5c4)[C@@H](CCC(O)=O)C(O)=O)c3c2c(=O)[nH]1 |r|
Show InChI InChI=1S/C24H21N5O6S/c25-24-27-20(32)19-18-11(2-1-3-16(18)36-21(19)28-24)9-26-13-4-5-14-12(8-13)10-29(22(14)33)15(23(34)35)6-7-17(30)31/h1-5,8,15,26H,6-7,9-10H2,(H,30,31)(H,34,35)(H3,25,27,28,32)/t15-/m0/s1
NCI pathway
Reactome pathway
n/an/a 100n/an/an/an/an/an/a
Duquesne University
Curated by ChEMBL
Assay Description
Inhibition of human DHFR by spectrophotometry
Bioorg Med Chem 19: 3585-94 (2011)
Article DOI: 10.1016/j.bmc.2011.03.067
BindingDB Entry DOI: 10.7270/Q22V2GGP
3D
3D Structure (crystal)
Dihydrofolate reductase (DHFR)
(Toxoplasma gondii)
BDBM50350771
(CHEMBL1738740)
Show SMILES Nc1nc2sc3cccc(CNc4ccc5C(=O)N(Cc5c4)[C@@H](CCC(O)=O)C(O)=O)c3c2c(=O)[nH]1 |r|
Show InChI InChI=1S/C24H21N5O6S/c25-24-27-20(32)19-18-11(2-1-3-16(18)36-21(19)28-24)9-26-13-4-5-14-12(8-13)10-29(22(14)33)15(23(34)35)6-7-17(30)31/h1-5,8,15,26H,6-7,9-10H2,(H,30,31)(H,34,35)(H3,25,27,28,32)/t15-/m0/s1
n/an/a 170n/an/an/an/an/an/a
Duquesne University
Curated by ChEMBL
Assay Description
Inhibition of Toxoplasma gondii TS assessed as oxidation of tetrahydrofolate to dihydrofolate after 2 to 12 mins by spectrophotometry
Bioorg Med Chem 19: 3585-94 (2011)
Article DOI: 10.1016/j.bmc.2011.03.067
BindingDB Entry DOI: 10.7270/Q22V2GGP