BDBM64732 MLS001204078::N-[(8-Hydroxy-quinolin-7-yl)-phenyl-methyl]-butyramide::N-[(8-hydroxy-7-quinolinyl)-phenylmethyl]butanamide::N-[(8-hydroxy-7-quinolyl)-phenyl-methyl]butyramide::N-[(8-hydroxyquinolin-7-yl)-phenylmethyl]butanamide::N-[(8-oxidanylquinolin-7-yl)-phenyl-methyl]butanamide::SMR000516558::cid_2876668
SMILES: CCCC(=O)NC(c1ccccc1)c1ccc2cccnc2c1O
InChI Key: InChIKey=RQALGBOYFSWXNZ-UHFFFAOYSA-N
Data: 3 IC50  2 EC50
Activity Spreadsheet -- Enzyme Inhibition Constant Data from BindingDB
Found 5 hits for monomerid = 64732
Trg + Lig
Ki
nM
ΔG°
kcal/mole
IC50
nM
Kd
nM
EC50/IC50
nM
koff
s-1
kon
M-1s-1
pHTemp
°C
heat shock protein 90
(Candida albicans)
BDBM64732
(MLS001204078 | N-[(8-Hydroxy-quinolin-7-yl)-phenyl...)
Show SMILES CCCC(=O)NC(c1ccccc1)c1ccc2cccnc2c1O
Show InChI InChI=1S/C20H20N2O2/c1-2-7-17(23)22-18(14-8-4-3-5-9-14)16-12-11-15-10-6-13-21-19(15)20(16)24/h3-6,8-13,18,24H,2,7H2,1H3,(H,22,23)
PCBioAssay
n/an/an/an/a 1.11E+3n/an/an/an/a
Broad Institute
Curated by PubChem BioAssay
Assay Description
Broad Institute: Reversing Antifungal Drug Resistance Project ID: 2037 Keywords: Candida albicans, drug resistance, fluconazole, Hsp90, Calcineurin, ...
PubChem Bioassay (2010)
BindingDB Entry DOI: 10.7270/Q2MC8XGG
heat shock protein 90
(Candida albicans)
BDBM64732
(MLS001204078 | N-[(8-Hydroxy-quinolin-7-yl)-phenyl...)
Show SMILES CCCC(=O)NC(c1ccccc1)c1ccc2cccnc2c1O
Show InChI InChI=1S/C20H20N2O2/c1-2-7-17(23)22-18(14-8-4-3-5-9-14)16-12-11-15-10-6-13-21-19(15)20(16)24/h3-6,8-13,18,24H,2,7H2,1H3,(H,22,23)
PCBioAssay
n/an/an/an/a>2.60E+5n/an/an/an/a
Broad Institute
Curated by PubChem BioAssay
Assay Description
Keywords: Candida albicans, drug resistance, Fluconazole, Hsp90, stress response Assay Overview: Method for determining if compound acts as Hsp90 inh...
PubChem Bioassay (2010)
BindingDB Entry DOI: 10.7270/Q2GM85R4
Integrase
(Human immunodeficiency virus 1)
BDBM64732
(MLS001204078 | N-[(8-Hydroxy-quinolin-7-yl)-phenyl...)
Show SMILES CCCC(=O)NC(c1ccccc1)c1ccc2cccnc2c1O
Show InChI InChI=1S/C20H20N2O2/c1-2-7-17(23)22-18(14-8-4-3-5-9-14)16-12-11-15-10-6-13-21-19(15)20(16)24/h3-6,8-13,18,24H,2,7H2,1H3,(H,22,23)
n/an/a>2.00E+4n/an/an/an/an/an/a
University of Southern California
Curated by ChEMBL
Assay Description
Inhibition of HIV-1 integrase 3'-processing activity
J Med Chem 56: 2311-22 (2013)
Article DOI: 10.1021/jm301632e
BindingDB Entry DOI: 10.7270/Q2348P98
Integrase
(Human immunodeficiency virus 1)
BDBM64732
(MLS001204078 | N-[(8-Hydroxy-quinolin-7-yl)-phenyl...)
Show SMILES CCCC(=O)NC(c1ccccc1)c1ccc2cccnc2c1O
Show InChI InChI=1S/C20H20N2O2/c1-2-7-17(23)22-18(14-8-4-3-5-9-14)16-12-11-15-10-6-13-21-19(15)20(16)24/h3-6,8-13,18,24H,2,7H2,1H3,(H,22,23)
n/an/a>2.00E+4n/an/an/an/an/an/a
University of Southern California
Curated by ChEMBL
Assay Description
Inhibition of HIV-1 integrase strand transfer activity
J Med Chem 56: 2311-22 (2013)
Article DOI: 10.1021/jm301632e
BindingDB Entry DOI: 10.7270/Q2348P98
exonuclease V (RecBCD complex), alpha chain
(Escherichia coli str. K-12 substr. MG1655)
BDBM64732
(MLS001204078 | N-[(8-Hydroxy-quinolin-7-yl)-phenyl...)
Show SMILES CCCC(=O)NC(c1ccccc1)c1ccc2cccnc2c1O
Show InChI InChI=1S/C20H20N2O2/c1-2-7-17(23)22-18(14-8-4-3-5-9-14)16-12-11-15-10-6-13-21-19(15)20(16)24/h3-6,8-13,18,24H,2,7H2,1H3,(H,22,23)
PCBioAssay
n/an/a>1.19E+5n/an/an/an/an/an/a
The Scripps Research Institute Molecular Screening Center
Curated by PubChem BioAssay
Assay Description
Source (MLPCN Center Name): The Scripps Research Institute Molecular Screening Center (SRIMSC) Affiliation: The Scripps Research Institute, TSRI Assa...
PubChem Bioassay (2010)
BindingDB Entry DOI: 10.7270/Q2TB15CW