BDBM7960 1H-1,3-benzodiazol-2-amine::2-Aminobenzimidazole::CHEMBL305513::CRA Fragment 9::Imidazole C-2 deriv. 3::JMC524454 Compound 5
SMILES: Nc1nc2ccccc2[nH]1
InChI Key: InChIKey=JWYUFVNJZUSCSM-UHFFFAOYSA-N
Data: 4 KI  4 IC50  1 Kd
PDB links: 2 PDB IDs match this monomer. 8 PDB IDs contain this monomer as substructures. 15 PDB IDs contain inhibitors having a similarity of 90% to this monomer.
Activity Spreadsheet -- Enzyme Inhibition Constant Data from BindingDB
Found 9 hits for monomerid = 7960
Trg + Lig
Ki
nM
ΔG°
kcal/mole
IC50
nM
Kd
nM
EC50/IC50
nM
koff
s-1
kon
M-1s-1
pHTemp
°C
Tryptase beta-2
(Homo sapiens (Human))
BDBM7960
(1H-1,3-benzodiazol-2-amine | 2-Aminobenzimidazole ...)
Show SMILES Nc1nc2ccccc2[nH]1
Show InChI InChI=1S/C7H7N3/c8-7-9-5-3-1-2-4-6(5)10-7/h1-4H,(H3,8,9,10)
Reactome pathway
1.10E+5 -5.34n/an/an/an/an/a7.422
Celera
Assay Description
Each enzyme was assayed with a set of different concentrations of each inhibitor. After addition of the appropriate substrate, the rate of hydrolysis...
Biochemistry 45: 5964-73 (2006)
Article DOI: 10.1021/bi060173m
BindingDB Entry DOI: 10.7270/Q2W09450
Serine protease 1
(Bos taurus (bovine))
BDBM7960
(1H-1,3-benzodiazol-2-amine | 2-Aminobenzimidazole ...)
Show SMILES Nc1nc2ccccc2[nH]1
Show InChI InChI=1S/C7H7N3/c8-7-9-5-3-1-2-4-6(5)10-7/h1-4H,(H3,8,9,10)
2.00E+5n/an/an/an/an/an/an/an/a
Celera
Assay Description
Each enzyme was assayed with a set of different concentrations of each inhibitor. After addition of the appropriate substrate, the rate of hydrolysis...
Biochemistry 45: 5964-73 (2006)
Article DOI: 10.1021/bi060173m
BindingDB Entry DOI: 10.7270/Q2W09450
Pteridine reductase
(Trypanosoma brucei brucei)
BDBM7960
(1H-1,3-benzodiazol-2-amine | 2-Aminobenzimidazole ...)
Show SMILES Nc1nc2ccccc2[nH]1
Show InChI InChI=1S/C7H7N3/c8-7-9-5-3-1-2-4-6(5)10-7/h1-4H,(H3,8,9,10)
2.88E+5 -4.79n/an/an/an/an/a6.023
University of Dundee
Assay Description
TbPTR1 activity was measured in 96-well microtiter plates via reduction of cytochrome c (cytc) as a result of the enzymatic production of tetrahydrob...
J Med Chem 52: 4454-65 (2009)
Article DOI: 10.1021/jm900414x
BindingDB Entry DOI: 10.7270/Q28050X3
3D
3D Structure (crystal)
Glutaminyl-peptide cyclotransferase
(Homo sapiens (Human))
BDBM7960
(1H-1,3-benzodiazol-2-amine | 2-Aminobenzimidazole ...)
Show SMILES Nc1nc2ccccc2[nH]1
Show InChI InChI=1S/C7H7N3/c8-7-9-5-3-1-2-4-6(5)10-7/h1-4H,(H3,8,9,10)
1.80E+6n/an/an/an/an/an/an/an/a
Probiodrug AG
Assay Description
QC activity was evaluated fluorometrically using Gln-AMC as substrate, and pyroglutamyl peptidase as the auxiliary enzyme. After conversion of Gln-AM...
J Biol Chem 278: 49773-9 (2003)
Article DOI: 10.1074/jbc.M309077200
BindingDB Entry DOI: 10.7270/Q2513WDS
Oxidized purine nucleoside triphosphate hydrolase
(Homo sapiens (Human))
BDBM7960
(1H-1,3-benzodiazol-2-amine | 2-Aminobenzimidazole ...)
Show SMILES Nc1nc2ccccc2[nH]1
Show InChI InChI=1S/C7H7N3/c8-7-9-5-3-1-2-4-6(5)10-7/h1-4H,(H3,8,9,10)
n/an/an/a 1.80E+4n/an/an/an/an/a
University of Zurich
Curated by ChEMBL
Assay Description
Binding affinity to recombinant His-tagged MTH1 (unknown origin) expressed in Escherichia coli BL21(DE3) assessed as dissociation constant by isother...
Eur J Med Chem 175: 107-113 (2019)
Article DOI: 10.1016/j.ejmech.2019.04.037
Membrane primary amine oxidase
(Rattus norvegicus (Rat))
BDBM7960
(1H-1,3-benzodiazol-2-amine | 2-Aminobenzimidazole ...)
Show SMILES Nc1nc2ccccc2[nH]1
Show InChI InChI=1S/C7H7N3/c8-7-9-5-3-1-2-4-6(5)10-7/h1-4H,(H3,8,9,10)
n/an/a 1.00E+3n/an/an/an/an/an/a
Astellas Pharma Inc.
Curated by ChEMBL
Assay Description
Inhibition of rat VAP-1 expressed in CHO cells using [14C]-benzylamine as substrate preincubated for 30 mins prior to substrate addition measured aft...
Bioorg Med Chem 21: 3873-81 (2013)
Article DOI: 10.1016/j.bmc.2013.04.011
BindingDB Entry DOI: 10.7270/Q22B90DG
Membrane primary amine oxidase
(Homo sapiens (Human))
BDBM7960
(1H-1,3-benzodiazol-2-amine | 2-Aminobenzimidazole ...)
Show SMILES Nc1nc2ccccc2[nH]1
Show InChI InChI=1S/C7H7N3/c8-7-9-5-3-1-2-4-6(5)10-7/h1-4H,(H3,8,9,10)
n/an/a 4.10E+3n/an/an/an/an/an/a
Astellas Pharma Inc.
Curated by ChEMBL
Assay Description
Inhibition of human VAP-1 expressed in CHO cells using [14C]-benzylamine as substrate preincubated for 30 mins prior to substrate addition measured a...
Bioorg Med Chem 21: 3873-81 (2013)
Article DOI: 10.1016/j.bmc.2013.04.011
BindingDB Entry DOI: 10.7270/Q22B90DG
Oxidized purine nucleoside triphosphate hydrolase
(Homo sapiens (Human))
BDBM7960
(1H-1,3-benzodiazol-2-amine | 2-Aminobenzimidazole ...)
Show SMILES Nc1nc2ccccc2[nH]1
Show InChI InChI=1S/C7H7N3/c8-7-9-5-3-1-2-4-6(5)10-7/h1-4H,(H3,8,9,10)
n/an/a 4.40E+4n/an/an/an/an/an/a
University of Zurich
Curated by ChEMBL
Assay Description
Inhibition of recombinant His-tagged MTH1 (unknown origin) expressed in Escherichia coli BL21(DE3) cells using dGTP as substrate incubated for 15 min...
Eur J Med Chem 175: 107-113 (2019)
Article DOI: 10.1016/j.ejmech.2019.04.037
Urokinase-type plasminogen activator
(Homo sapiens (Human))
BDBM7960
(1H-1,3-benzodiazol-2-amine | 2-Aminobenzimidazole ...)
Show SMILES Nc1nc2ccccc2[nH]1
Show InChI InChI=1S/C7H7N3/c8-7-9-5-3-1-2-4-6(5)10-7/h1-4H,(H3,8,9,10)
Reactome pathway
n/an/a 2.00E+5n/an/an/an/an/an/a
Abbott Laboratories
Curated by ChEMBL
Assay Description
Inhibitory activity against Urokinase-type plasminogen activator
J Med Chem 43: 3862-6 (2000)
BindingDB Entry DOI: 10.7270/Q2VD6XQC