Reaction Details
TargetDNA damage-binding protein 1
LigandBDBM50070114
Substrate/Competitorn/a
Meas. Tech.Fluorescence thermal melt assay
pH8±n/a
Temperature343.15±n/a K
IC50 30000±0 nM
Commentsextracted
Citation Lopez-Girona, AMendy, DIto, TMiller, KGandhi, AKKang, JKarasawa, SCarmel, GJackson, PAbbasian, MMahmoudi, ACathers, BRychak, EGaidarova, SChen, RSchafer, PHHanda, HDaniel, TOEvans, JFChopra, R Cereblon is a direct protein target for immunomodulatory and antiproliferative activities of lenalidomide and pomalidomide. Leukemia26:2326-35 (2012) 
 
DNA damage-binding protein 1
Name:DNA damage-binding protein 1
Type:Protein
Mol. Mass.:126936.22
Organism:Homo sapiens (Human)
Description:Q16531
Residue:1140
BDBM50070114
NameBDBM50070114
Synonyms:(+/-)-thalidomide 2-(2,6-dioxopiperidin-3-yl)isoindoline-1,3-dione K-17 Thalomid [(R,S)-2-(2,6-dioxo-3-piperidinyl)-1H-isoindole-1,3(2H)-dione
TypeSmall organic molecule
Emp. Form.C13H10N2O4
Mol. Mass.258.2295
SMILESO=C1N(C2CCC(=O)NC2=O)C(=O)c2ccccc12