Reaction Details
TargetTyrosine-protein kinase JAK3
LigandBDBM316515
Substrate/Competitorn/a
Meas. Tech.Caliper Enzyme Assay (4 uM ATP)
IC50<0.100±n/a nM
Citation Thorarensen, ABrown, MFCasimiro-Garcia, AChe, YCoe, JWFlanagan, MEGilbert, AMHayward, MMLangille, JDMontgomery, JITelliez, JUnwalla, RJTrujillo, JI Pyrrolo[2,3-d]pyrimidinyl, pyrrolo[2,3-b]pyrazinyl and pyrrolo[2,3-d]pyridinyl acrylamides US Patent US11111242 Publication Date 9/7/2021
 
Tyrosine-protein kinase JAK3
Name:Tyrosine-protein kinase JAK3
Type:Protein
Mol. Mass.:125111.08
Organism:Homo sapiens (Human)
Description:P52333
Residue:1124
BDBM316515
NameBDBM316515
Synonyms:US11111242, Example 3 | US9617258, Example 3
TypeSmall organic molecule
Emp. Form.C14H16ClN5O
Mol. Mass.305.763
SMILESClc1c[nH]c2ncnc(N[C@@H]3CCCN(C3)C(=O)C=C)c12