Reaction Details
TargetAcetyl-CoA carboxylase 1
LigandBDBM527001
Substrate/Competitorn/a
Meas. Tech.ACC1 Enzyme Activity Assay
IC50 0.680±n/a nM
Citation Wang, YZhao, LWang, YQuan, XJiang, CChen, HChen, MLi, CLiao, YLiu, QWang, CWang, HYang, SZheng, G Compound as ACC inhibitor and use thereof US Patent US11186587 Publication Date 11/30/2021
 
Acetyl-CoA carboxylase 1
Name:Acetyl-CoA carboxylase 1
Type:Protein
Mol. Mass.:265543.22
Organism:Homo sapiens (Human)
Description:Q13085
Residue:2346
BDBM527001
NameBDBM527001
Synonyms:US11186587, Example 4
TypeSmall organic molecule
Emp. Form.C30H33N3O8S
Mol. Mass.595.663
SMILESCOc1ccccc1[C@H](Cn1c2sc(c(C)c2c(=O)n([C@H]2C[C@](C)(C2)C(O)=O)c1=O)-c1ncco1)OC1CCOCC1