Reaction Details
TargetAcetyl-CoA carboxylase 1
LigandBDBM527094
Substrate/Competitorn/a
Meas. Tech.ACC1 Enzyme Activity Assay
IC50 1.69±n/a nM
Citation Wang, YZhao, LWang, YQuan, XJiang, CChen, HChen, MLi, CLiao, YLiu, QWang, CWang, HYang, SZheng, G Compound as ACC inhibitor and use thereof US Patent US11186587 Publication Date 11/30/2021
 
Acetyl-CoA carboxylase 1
Name:Acetyl-CoA carboxylase 1
Type:Protein
Mol. Mass.:265543.22
Organism:Homo sapiens (Human)
Description:Q13085
Residue:2346
BDBM527094
NameBDBM527094
Synonyms:US11186587, Example 14
TypeSmall organic molecule
Emp. Form.C31H32N6O7S
Mol. Mass.632.687
SMILESCOc1ccccc1C(Cn1c2sc(c(C)c2c(=O)n(C2CN(C2)C(=O)c2ncc[nH]2)c1=O)-c1ncco1)OC1CCOCC1