Reaction Details
TargetAcetyl-CoA carboxylase 1
LigandBDBM527538
Substrate/Competitorn/a
Meas. Tech.ACC1 Enzyme Activity Assay
IC50 0.700±n/a nM
Citation Wang, YZhao, LWang, YQuan, XJiang, CChen, HChen, MLi, CLiao, YLiu, QWang, CWang, HYang, SZheng, G Compound as ACC inhibitor and use thereof US Patent US11186587 Publication Date 11/30/2021
 
Acetyl-CoA carboxylase 1
Name:Acetyl-CoA carboxylase 1
Type:Protein
Mol. Mass.:265543.22
Organism:Homo sapiens (Human)
Description:Q13085
Residue:2346
BDBM527538
NameBDBM527538
Synonyms:US11186587, Example 21
TypeSmall organic molecule
Emp. Form.C32H36N4O8S
Mol. Mass.636.715
SMILESCOc1ccccc1C(Cn1c2sc(c(C)c2c(=O)n(c1=O)C(C)(C)C(O)=O)-c1ncco1)OC1CCN(CC1)C(=O)C1CC1