Reaction Details
TargetCannabinoid receptor 1
LigandBDBM532438
Substrate/Competitorn/a
Meas. Tech.Radioligand Binding Assay
EC50 0.170±n/a nM
Citation Jones, RMHan, SThoresen, LJung, JStrah-Pleynet, SZhu, XXiong, YYue, D Cannabinoid receptor modulators US Patent US11214548 Publication Date 1/4/2022
 
Cannabinoid receptor 1
Name:Cannabinoid receptor 1
Type:G Protein-Coupled Receptor (GPCR)
Mol. Mass.:52868.96
Organism:Homo sapiens (Human)
Description:P21554
Residue:472
BDBM532438
NameBDBM532438
Synonyms:US11214548, Compound 634
TypeSmall organic molecule
Emp. Form.C21H24F2N4O2
Mol. Mass.402.4377
SMILESCNC(=O)[C@@H](NC(=O)c1nn(c2[C@@H]3C[C@@H]3Cc12)-c1ccc(F)cc1F)C(C)(C)C