Reaction Details
TargetKelch-like ECH-associated protein 1 [321-609]
LigandBDBM304755
Substrate/Competitorn/a
Meas. Tech.Nrf2-Keap1 FP Assay #1
IC50<10±n/a nM
Citation Davies, TGWoolford, AJWillems, HMNorton, DHeightman, TDKerns, JK Nrf2 regulators US Patent US10144731 Publication Date 12/4/2018
 
Kelch-like ECH-associated protein 1 [321-609]
Name:Kelch-like ECH-associated protein 1 [321-609]
Type:Enzyme Catalytic Domain
Mol. Mass.:31620.58
Organism:Homo sapiens (Human)
Description:Q14145[321-609]
Residue:289
BDBM304755
NameBDBM304755
Synonyms:3-(3-(((R)-4-ethyl-1,1-dioxido-3,4-dihydro-2H-pyrido[2,3-b][1,4,5]oxathiazepin-2-yl)methyl)-4-methylphenyl)-3-(1-ethyl-4-methyl-1H-benzo[d][1,2,3]triazol-5-yl)propanoic acid BDBM304885 US10144731, Example 40
TypeSmall organic molecule
Emp. Form.C29H33N5O5S
Mol. Mass.563.668
SMILESCC[C@@H]1CN(Cc2cc(ccc2C)C(CC(O)=O)c2ccc3n(CC)nnc3c2C)S(=O)(=O)c2cccnc2O1