Reaction Details
TargetActivin receptor type-1B
LigandBDBM280345
Substrate/Competitorn/a
Meas. Tech.In Vitro Kinase Assay - Inhibition of ALK1/2/3/4/5/6 Kinases
IC50 30.4±n/a nM
Citation Rai, RChakravarty, SPujala, BShinde, BUNayak, AKAgarwal, AKRamachandran, SAPham, SM Compounds and methods of use US Patent US11702401 Publication Date 7/18/2023
 
Activin receptor type-1B
Name:Activin receptor type-1B
Type:PROTEIN
Mol. Mass.:56810.99
Organism:Homo sapiens (Human)
Description:ChEMBL_587064
Residue:505
BDBM280345
NameBDBM280345
Synonyms:(S)-4-(2-(5-chloro-2-fluorophenyl)-5-isopropylpyridin-4-ylamino)-N-(2-hydroxypropyl)pyrimidine-5-carboxamide US10501436, Compound 12a US11702401, Compound 12a
TypeSmall organic molecule
Emp. Form.C22H23ClFN5O2
Mol. Mass.443.902
SMILESC[C@H](O)CNC(=O)c1cncnc1Nc1cc(ncc1C(C)C)-c1cc(Cl)ccc1F