Reaction Details
TargetInterleukin-1 receptor-associated kinase 4
LigandBDBM50239508
Substrate/Competitorn/a
Meas. Tech.IRAK4 Enzymatic DELFIA Assay, Protocol A
IC50 0.600±n/a nM
Citation Trzupek, JDLee, KLBunnage, MEHan, SHepworth, DLovering, FEMathias, JPPapaioannou, NPierce, BSStrohbach, JWWright, SWZapf, CWGavrin, LKLee, AAnderson, DRCurran, KJDehnhardt, CMSaiah, EGoldberg, JAWang, XHuang, HVargas, RLowe, MDPatny, A Bicyclic-fused heteroaryl or aryl compounds US Patent US11702424 Publication Date 7/18/2023
 
Interleukin-1 receptor-associated kinase 4
Name:Interleukin-1 receptor-associated kinase 4
Type:Protein
Mol. Mass.:51519.08
Organism:Homo sapiens (Human)
Description:Q9NWZ3
Residue:460
BDBM50239508
NameBDBM50239508
Synonyms:CHEMBL4085199 US10793579, Example 309 | US11702424, Example 309
TypeSmall organic molecule
Emp. Form.C18H18FN3O4
Mol. Mass.359.3516
SMILES[H][C@]12[C@H](C)[C@@]1(F)C(=O)N[C@@H]2COc1nccc2cc(C(N)=O)c(OC)cc12