Reaction Details
TargetAcetylcholinesterase
LigandBDBM10439
Substrate/CompetitorBDBM8959
Meas. Tech.Enzyme Inhibition Assay
pH7±n/a
Temperature295.15±n/a K
IC50 151±36 nM
Citation Wong, DMGreenblatt, HMDvir, HCarlier, PRHan, YFPang, YPSilman, ISussman, JL Acetylcholinesterase complexed with bivalent ligands related to huperzine a: experimental evidence for species-dependent protein-ligand complementarity. J Am Chem Soc125:363-73 (2003) 
 
Acetylcholinesterase
Name:Acetylcholinesterase
Type:Enzyme
Mol. Mass.:68193.62
Organism:Rattus norvegicus (rat)
Description:P37136
Residue:614
BDBM10439
BDBM8959
NameBDBM10439
Synonyms:(5S)-5-[(10-{[(5S)-2-oxo-1,2,5,6,7,8-hexahydroquinolin-5-yl]amino}decyl)amino]-1,2,5,6,7,8-hexahydroquinolin-2-one | (S,S)-(-)-bis(10)-hupyridone
TypeSmall organic molecule
Emp. Form.C28H42N4O2
Mol. Mass.466.6587
SMILESO=c1ccc2[C@H](CCCc2[nH]1)NCCCCCCCCCCN[C@H]1CCCc2[nH]c(=O)ccc12