Reaction Details
TargetCyclin-dependent kinase 9
LigandBDBM316182
Substrate/Competitorn/a
Meas. Tech.Fluorescent Polarization Assay
IC50<100±n/a nM
Citation Lori, FChafouleas, JDe Forni, DSolinas, AVarga, ZGreff, ZÖrfi, LKéri, G 4,6-disubstituted aminopyrimidine derivatives have anti-HIV activity US Patent US9617225 Publication Date 4/11/2017
 
Cyclin-dependent kinase 9
Name:Cyclin-dependent kinase 9
Type:Enzyme Subunit
Mol. Mass.:42789.13
Organism:Homo sapiens (Human)
Description:n/a
Residue:372
BDBM316182
NameBDBM316182
Synonyms:(2-methoxy-5-(6-(2-methoxyphenyl) pyrimidin-4-ylamino)phenyl) (methylsulfamoyl)amine US9617225, Example 10
TypeSmall organic molecule
Emp. Form.C19H21N5O4S
Mol. Mass.415.466
SMILESCNS(=O)(=O)Nc1cc(Nc2cc(ncn2)-c2ccccc2OC)ccc1OC