Reaction Details
TargetCyclin-dependent kinase 9
LigandBDBM316188
Substrate/Competitorn/a
Meas. Tech.Fluorescent Polarization Assay
IC50<100±n/a nM
Citation Lori, FChafouleas, JDe Forni, DSolinas, AVarga, ZGreff, ZÖrfi, LKéri, G 4,6-disubstituted aminopyrimidine derivatives have anti-HIV activity US Patent US9617225 Publication Date 4/11/2017
 
Cyclin-dependent kinase 9
Name:Cyclin-dependent kinase 9
Type:Enzyme Subunit
Mol. Mass.:42789.13
Organism:Homo sapiens (Human)
Description:n/a
Residue:372
BDBM316188
NameBDBM316188
Synonyms:N-(3-((1H-benzo[d]imidazol-1- yl)methyl)-4-chlorophenyl)-6-(2- methoxyphenyl)pyrimidin-4-amine US9617225, Example 16
TypeSmall organic molecule
Emp. Form.C25H20ClN5O
Mol. Mass.441.912
SMILESCOc1ccccc1-c1cc(Nc2ccc(Cl)c(Cn3cnc4ccccc34)c2)ncn1