Reaction Details
TargetCyclin-dependent kinase 9
LigandBDBM316204
Substrate/Competitorn/a
Meas. Tech.Fluorescent Polarization Assay
IC50<100±n/a nM
Citation Lori, FChafouleas, JDe Forni, DSolinas, AVarga, ZGreff, ZÖrfi, LKéri, G 4,6-disubstituted aminopyrimidine derivatives have anti-HIV activity US Patent US9617225 Publication Date 4/11/2017
 
Cyclin-dependent kinase 9
Name:Cyclin-dependent kinase 9
Type:Enzyme Subunit
Mol. Mass.:42789.13
Organism:Homo sapiens (Human)
Description:n/a
Residue:372
BDBM316204
NameBDBM316204
Synonyms:2-methoxy-5-(6-(2- methoxyphenyl)pyrimidin-4- ylamino)phenol US9617225, Example 32
TypeSmall organic molecule
Emp. Form.C18H17N3O3
Mol. Mass.323.3459
SMILESCOc1ccc(Nc2cc(ncn2)-c2ccccc2OC)cc1O