Reaction Details
TargetCyclin-dependent kinase 9
LigandBDBM316210
Substrate/Competitorn/a
Meas. Tech.Fluorescent Polarization Assay
IC50<100±n/a nM
Citation Lori, FChafouleas, JDe Forni, DSolinas, AVarga, ZGreff, ZÖrfi, LKéri, G 4,6-disubstituted aminopyrimidine derivatives have anti-HIV activity US Patent US9617225 Publication Date 4/11/2017
 
Cyclin-dependent kinase 9
Name:Cyclin-dependent kinase 9
Type:Enzyme Subunit
Mol. Mass.:42789.13
Organism:Homo sapiens (Human)
Description:n/a
Residue:372
BDBM316210
NameBDBM316210
Synonyms:5-(6-(2-methoxyphenyl)pyrimidin-4-ylamino)-2-(4-methylpiperazin-1-yl)benzenesulfonamide US9617225, Example 38
TypeSmall organic molecule
Emp. Form.C22H26N6O3S
Mol. Mass.454.545
SMILESCOc1ccccc1-c1cc(Nc2ccc(N3CCN(C)CC3)c(c2)S(N)(=O)=O)ncn1