Reaction Details
TargetCyclin-dependent kinase 9
LigandBDBM316211
Substrate/Competitorn/a
Meas. Tech.Fluorescent Polarization Assay
IC50<100±n/a nM
Citation Lori, FChafouleas, JDe Forni, DSolinas, AVarga, ZGreff, ZÖrfi, LKéri, G 4,6-disubstituted aminopyrimidine derivatives have anti-HIV activity US Patent US9617225 Publication Date 4/11/2017
 
Cyclin-dependent kinase 9
Name:Cyclin-dependent kinase 9
Type:Enzyme Subunit
Mol. Mass.:42789.13
Organism:Homo sapiens (Human)
Description:n/a
Residue:372
BDBM316211
NameBDBM316211
Synonyms:N-(3-((1H-benzo[d]imidazol-1-yl)methyl)-4-ethoxyphenyl)-6-(2-methoxyphenyl)pyrimidin-4-amine US9617225, Example 39
TypeSmall organic molecule
Emp. Form.C27H25N5O2
Mol. Mass.451.5197
SMILESCCOc1ccc(Nc2cc(ncn2)-c2ccccc2OC)cc1Cn1cnc2ccccc12