Reaction Details
TargetCyclin-dependent kinase 9
LigandBDBM316285
Substrate/Competitorn/a
Meas. Tech.Fluorescent Polarization Assay
IC50<100±n/a nM
Citation Lori, FChafouleas, JDe Forni, DSolinas, AVarga, ZGreff, ZÖrfi, LKéri, G 4,6-disubstituted aminopyrimidine derivatives have anti-HIV activity US Patent US9617225 Publication Date 4/11/2017
 
Cyclin-dependent kinase 9
Name:Cyclin-dependent kinase 9
Type:Enzyme Subunit
Mol. Mass.:42789.13
Organism:Homo sapiens (Human)
Description:n/a
Residue:372
BDBM316285
NameBDBM316285
Synonyms:2-Dimethylamino-5-[6-(4-fluoro-2-methoxy-phenyl)-pyrimidin-4-ylamino]-benzamide US9617225, Example 113
TypeSmall organic molecule
Emp. Form.C20H20FN5O2
Mol. Mass.381.4035
SMILESCOc1cc(F)ccc1-c1cc(Nc2ccc(N(C)C)c(c2)C(N)=O)ncn1