Reaction Details
TargetTyrosine-protein kinase JAK3
LigandBDBM316556
Substrate/Competitorn/a
Meas. Tech.JAK Caliper Enzyme Assay
IC50 0.300±n/a nM
Citation Thorarensen, ABrown, MFCasimiro-Garcia, AChe, YCoe, JWFlanagan, MEGilbert, AMHayward, MMLangille, JDMontgomery, JITelliez, JUnwalla, RJTrujillo, JI Pyrrolo[2,3-d]pyrimidinyl, pyrrolo[2,3-b]pyrazinyl and pyrrolo[2,3-d]pyridinyl acrylamides US Patent US9617258 Publication Date 4/11/2017
 
Tyrosine-protein kinase JAK3
Name:Tyrosine-protein kinase JAK3
Type:Protein
Mol. Mass.:125111.08
Organism:Homo sapiens (Human)
Description:P52333
Residue:1124
BDBM316556
NameBDBM316556
Synonyms:1-{(3R)-3-[(5-ethyl-7H-pyrrolo[2,3-d]pyrimidin-4-yl)amino]piperidin-1-yl}prop-2-en-1-one US9617258, Example 44
TypeSmall organic molecule
Emp. Form.C16H21N5O
Mol. Mass.299.3708
SMILESCCc1c[nH]c2ncnc(N[C@@H]3CCCN(C3)C(=O)C=C)c12