Reaction Details
TargetTyrosine-protein kinase JAK3
LigandBDBM316711
Substrate/Competitorn/a
Meas. Tech.JAK Caliper Enzyme Assay
IC50 0.100±n/a nM
Citation Thorarensen, ABrown, MFCasimiro-Garcia, AChe, YCoe, JWFlanagan, MEGilbert, AMHayward, MMLangille, JDMontgomery, JITelliez, JUnwalla, RJTrujillo, JI Pyrrolo[2,3-d]pyrimidinyl, pyrrolo[2,3-b]pyrazinyl and pyrrolo[2,3-d]pyridinyl acrylamides US Patent US9617258 Publication Date 4/11/2017
 
Tyrosine-protein kinase JAK3
Name:Tyrosine-protein kinase JAK3
Type:Protein
Mol. Mass.:125111.08
Organism:Homo sapiens (Human)
Description:P52333
Residue:1124
BDBM316711
NameBDBM316711
Synonyms:5-{2-[(1-acryloylpiperidin-4-yl)amino]-5H-pyrrolo[2,3-b]pyrazin-7-yl}pyridine-3-carbonitrile US9617258, Example 206
TypeSmall organic molecule
Emp. Form.C20H19N7O
Mol. Mass.373.4112
SMILESC=CC(=O)N1CCC(CC1)Nc1cnc2[nH]cc(-c3cncc(c3)C#N)c2n1