Reaction Details
TargetTyrosine-protein kinase JAK3
LigandBDBM316738
Substrate/Competitorn/a
Meas. Tech.JAK Caliper Enzyme Assay
IC50 0.300±n/a nM
Citation Thorarensen, ABrown, MFCasimiro-Garcia, AChe, YCoe, JWFlanagan, MEGilbert, AMHayward, MMLangille, JDMontgomery, JITelliez, JUnwalla, RJTrujillo, JI Pyrrolo[2,3-d]pyrimidinyl, pyrrolo[2,3-b]pyrazinyl and pyrrolo[2,3-d]pyridinyl acrylamides US Patent US9617258 Publication Date 4/11/2017
 
Tyrosine-protein kinase JAK3
Name:Tyrosine-protein kinase JAK3
Type:Protein
Mol. Mass.:125111.08
Organism:Homo sapiens (Human)
Description:P52333
Residue:1124
BDBM316738
NameBDBM316738
Synonyms:2-[(1-acryloylpiperidin-4-yl)amino]-N-[(1-hydroxy-3-methylcyclopentyl)methyl]-5H-pyrrolo[2,3-b]pyrazine-7-carboxamide US9617258, Example 235
TypeSmall organic molecule
Emp. Form.C22H30N6O3
Mol. Mass.426.512
SMILESCC1CCC(O)(CNC(=O)c2c[nH]c3ncc(NC4CCN(CC4)C(=O)C=C)nc23)C1