Reaction Details
TargetTyrosine-protein kinase JAK3
LigandBDBM316794
Substrate/Competitorn/a
Meas. Tech.JAK Caliper Enzyme Assay
IC50 0.200±n/a nM
Citation Thorarensen, ABrown, MFCasimiro-Garcia, AChe, YCoe, JWFlanagan, MEGilbert, AMHayward, MMLangille, JDMontgomery, JITelliez, JUnwalla, RJTrujillo, JI Pyrrolo[2,3-d]pyrimidinyl, pyrrolo[2,3-b]pyrazinyl and pyrrolo[2,3-d]pyridinyl acrylamides US Patent US9617258 Publication Date 4/11/2017
 
Tyrosine-protein kinase JAK3
Name:Tyrosine-protein kinase JAK3
Type:Protein
Mol. Mass.:125111.08
Organism:Homo sapiens (Human)
Description:P52333
Residue:1124
BDBM316794
NameBDBM316794
Synonyms:2-{[(3R,4R)-1-acryloyl-3-fluoropiperidin-4-yl]amino}-N-(propan-2-yl)-5H-pyrrolo[2,3-b]pyrazine-7-carboxamide US9617258, Example 291
TypeSmall organic molecule
Emp. Form.C18H23FN6O2
Mol. Mass.374.4126
SMILESCC(C)NC(=O)c1c[nH]c2ncc(N[C@@H]3CCN(C[C@H]3F)C(=O)C=C)nc12