Reaction Details
TargetTyrosine-protein kinase BTK
LigandBDBM317631
Substrate/Competitorn/a
Meas. Tech.Inhibition Assay
IC50 13.0±n/a nM
Citation Lopez-Tapia, FJSo, SQiao, QDominique, R Inhibitors of bruton's tyrosine kinase US Patent US9624201 Publication Date 4/18/2017
 
Tyrosine-protein kinase BTK
Name:Tyrosine-protein kinase BTK
Type:Enzyme
Mol. Mass.:76289.95
Organism:Homo sapiens (Human)
Description:Q06187
Residue:659
BDBM317631
NameBDBM317631
Synonyms:2-{5-Amino- 1-[4-(3-cyano- phenoxy)-2- methyl- phenyl]-1H- pyrazole-4- carbonyl}-1H- indole-4- carboxylic acid methylamide US11104668, Compound 21 | US9624201, Compound 21
TypeSmall organic molecule
Emp. Form.C28H22N6O3
Mol. Mass.490.5127
SMILESCNC(=O)c1cccc2[nH]c(cc12)C(=O)c1cnn(c1N)-c1ccc(Oc2cccc(c2)C#N)cc1C