Reaction Details
TargetDipeptidyl peptidase 4
LigandBDBM11121
Substrate/CompetitorBDBM11114
Meas. Tech.DPPIV Inhibition Assay
pH7.4±n/a
Temperature298.15±n/a K
Ki 3.1±n/a nM
Km73000±n/a nM
Citation Qiao, LBaumann, CACrysler, CSNinan, NSAbad, MCSpurlino, JCDesjarlais, RLKervinen, JNeeper, MPBayoumy, SSWilliams, RDeckman, ICDasgupta, MReed, RLHuebert, NDTomczuk, BEMoriarty, KJ Discovery, SAR, and X-ray structure of novel biaryl-based dipeptidyl peptidase IV inhibitors. Bioorg Med Chem Lett16:123-8 (2006) 
 
Dipeptidyl peptidase 4
Name:Dipeptidyl peptidase 4
Type:Enzyme
Mol. Mass.:88271.01
Organism:Homo sapiens (Human)
Description:P27487
Residue:766
BDBM11121
BDBM11114
NameBDBM11121
Synonyms:(2S)-1-[(2S)-2-amino-3-[4-(4-fluorophenyl)phenyl]propanoyl]pyrrolidine-2-carbonitrile | 4-substituted phenylalanine cyano-(S)-pyrrolidine deriv. 8
TypeSmall organic molecule
Emp. Form.C20H20FN3O
Mol. Mass.337.3907
SMILESN[C@@H](Cc1ccc(cc1)-c1ccc(F)cc1)C(=O)N1CCC[C@H]1C#N