Reaction Details
TargetDipeptidyl peptidase 4
LigandBDBM11130
Substrate/CompetitorBDBM11114
Meas. Tech.DPPIV Inhibition Assay
pH7.4±n/a
Temperature298.15±n/a K
Ki 980±n/a nM
Km73000±n/a nM
Citation Qiao, LBaumann, CACrysler, CSNinan, NSAbad, MCSpurlino, JCDesjarlais, RLKervinen, JNeeper, MPBayoumy, SSWilliams, RDeckman, ICDasgupta, MReed, RLHuebert, NDTomczuk, BEMoriarty, KJ Discovery, SAR, and X-ray structure of novel biaryl-based dipeptidyl peptidase IV inhibitors. Bioorg Med Chem Lett16:123-8 (2006) 
 
Dipeptidyl peptidase 4
Name:Dipeptidyl peptidase 4
Type:Enzyme
Mol. Mass.:88271.01
Organism:Homo sapiens (Human)
Description:P27487
Residue:766
BDBM11130
BDBM11114
NameBDBM11130
Synonyms:(2S)-2-amino-3-(4-iodophenyl)-1-(1,3-thiazolidin-3-yl)propan-1-one | aminoacylthiazolidine 17
TypeSmall organic molecule
Emp. Form.C12H15IN2OS
Mol. Mass.362.23
SMILESN[C@@H](Cc1ccc(I)cc1)C(=O)N1CCSC1