Reaction Details
TargetDipeptidyl peptidase 4
LigandBDBM11131
Substrate/CompetitorBDBM11114
Meas. Tech.DPPIV Inhibition Assay
pH7.4±n/a
Temperature298.15±n/a K
Ki 355±n/a nM
Km73000±n/a nM
Citation Qiao, LBaumann, CACrysler, CSNinan, NSAbad, MCSpurlino, JCDesjarlais, RLKervinen, JNeeper, MPBayoumy, SSWilliams, RDeckman, ICDasgupta, MReed, RLHuebert, NDTomczuk, BEMoriarty, KJ Discovery, SAR, and X-ray structure of novel biaryl-based dipeptidyl peptidase IV inhibitors. Bioorg Med Chem Lett16:123-8 (2006) 
 
Dipeptidyl peptidase 4
Name:Dipeptidyl peptidase 4
Type:Enzyme
Mol. Mass.:88271.01
Organism:Homo sapiens (Human)
Description:P27487
Residue:766
BDBM11131
BDBM11114
NameBDBM11131
Synonyms:(2S)-2-amino-3-[4-(pyridin-2-yl)phenyl]-1-(1,3-thiazolidin-3-yl)propan-1-one | aminoacylthiazolidine 18
TypeSmall organic molecule
Emp. Form.C17H19N3OS
Mol. Mass.313.417
SMILESN[C@@H](Cc1ccc(cc1)-c1ccccn1)C(=O)N1CCSC1