Reaction Details
TargetDipeptidyl peptidase 4
LigandBDBM11137
Substrate/CompetitorBDBM11114
Meas. Tech.DPPIV Inhibition Assay
pH7.4±n/a
Temperature298.15±n/a K
Ki 8900±n/a nM
Km73000±n/a nM
Citation Qiao, LBaumann, CACrysler, CSNinan, NSAbad, MCSpurlino, JCDesjarlais, RLKervinen, JNeeper, MPBayoumy, SSWilliams, RDeckman, ICDasgupta, MReed, RLHuebert, NDTomczuk, BEMoriarty, KJ Discovery, SAR, and X-ray structure of novel biaryl-based dipeptidyl peptidase IV inhibitors. Bioorg Med Chem Lett16:123-8 (2006) 
 
Dipeptidyl peptidase 4
Name:Dipeptidyl peptidase 4
Type:Enzyme
Mol. Mass.:88271.01
Organism:Homo sapiens (Human)
Description:P27487
Residue:766
BDBM11137
BDBM11114
NameBDBM11137
Synonyms:(2S)-2-amino-3-(naphthalen-2-yl)-1-(1,3-thiazolidin-3-yl)propan-1-one | aminoacylthiazolidine 24
TypeSmall organic molecule
Emp. Form.C16H18N2OS
Mol. Mass.286.392
SMILESN[C@@H](Cc1ccc2ccccc2c1)C(=O)N1CCSC1