Reaction Details
TargetDipeptidyl peptidase 4
LigandBDBM11142
Substrate/CompetitorBDBM11057
Meas. Tech.Dipeptidyl Peptidase Inhibition Assay
pH7.5±n/a
Temperature310.15±n/a K
IC50 13±n/a nM
Citation Edmondson, SDMastracchio, AMathvink, RJHe, JHarper, BPark, YJBeconi, MDi Salvo, JEiermann, GJHe, HLeiting, BLeone, JFLevorse, DALyons, KPatel, RAPatel, SBPetrov, AScapin, GShang, JRoy, RSSmith, AWu, JKXu, SZhu, BThornberry, NAWeber, AE (2S,3S)-3-Amino-4-(3,3-difluoropyrrolidin-1-yl)-N,N-dimethyl-4-oxo-2-(4-[1,2,4]triazolo[1,5-a]-pyridin-6-ylphenyl)butanamide: a selective alpha-amino amide dipeptidyl peptidase IV inhibitor for the treatment of type 2 diabetes. J Med Chem49:3614-27 (2006) 
 
Dipeptidyl peptidase 4
Name:Dipeptidyl peptidase 4
Type:Enzyme
Mol. Mass.:88271.01
Organism:Homo sapiens (Human)
Description:P27487
Residue:766
BDBM11142
BDBM11057
NameBDBM11142
Synonyms:(1S,2S)-1-(dimethylcarbamoyl)-3-[(3S)-3-fluoropyrrolidin-1-yl]-1-(4-{imidazo[1,2-a]pyridin-6-yl}phenyl)-3-oxopropan-2-aminium; 2,2,2-trifluoroacetate Biarylphenylalanine (S)-Fluoropyrrolidide Amide 21
TypeSmall organic molecule
Emp. Form.C23H27FN5O2
Mol. Mass.424.4906
SMILESCN(C)C(=O)[C@H]([C@H]([NH3+])C(=O)N1CC[C@H](F)C1)c1ccc(cc1)-c1ccc2nccn2c1