Reaction Details
TargetNeuronal acetylcholine receptor subunit alpha-7
LigandBDBM322277
Substrate/Competitorn/a
Meas. Tech.Human alpha7 nAChR Binding Assay
Ki 110±n/a nM
Citation Acharya, RBurnett, DABursavich, MGCook, ASHarrison, BAKoenig, GMcriner, AJ Geminal substituted quinuclidine amide compounds as agonists of α-7 nicotonic acetylcholine receptors US Patent US10183938 Publication Date 1/22/2019
 
Neuronal acetylcholine receptor subunit alpha-7
Name:Neuronal acetylcholine receptor subunit alpha-7
Type:n/a
Mol. Mass.:56448.33
Organism:Homo sapiens (Human)
Description: CHRNA7 (NACHRA7)
Residue:502
BDBM322277
NameBDBM322277
Synonyms:N-(1'-azaspiro[cyclopropane-1,2'-bicyclo[2.2.2]octan]-3'-yl)benzo[b]thiophene-6-carboxamide | US10183938, Compound 58a
TypeSmall organic molecule
Emp. Form.C18H20N2OS
Mol. Mass.312.429
SMILESO=C(NC1C2CCN(CC2)C11CC1)c1ccc2ccsc2c1