Reaction Details
TargetNeuronal acetylcholine receptor subunit alpha-7
LigandBDBM322362
Substrate/Competitorn/a
Meas. Tech.Human alpha7 nAChR Binding Assay
Ki 140±n/a nM
Citation Acharya, RBurnett, DABursavich, MGCook, ASHarrison, BAKoenig, GMcriner, AJ Geminal substituted quinuclidine amide compounds as agonists of α-7 nicotonic acetylcholine receptors US Patent US10183938 Publication Date 1/22/2019
 
Neuronal acetylcholine receptor subunit alpha-7
Name:Neuronal acetylcholine receptor subunit alpha-7
Type:n/a
Mol. Mass.:56448.33
Organism:Homo sapiens (Human)
Description: CHRNA7 (NACHRA7)
Residue:502
BDBM322362
NameBDBM322362
Synonyms:(R)-N-(2,2-dimethylquinuclidin-3-yl)-7-methylbenzo[b]thiophene-2-carboxamide | US10183938, Compound (R)-126
TypeSmall organic molecule
Emp. Form.C19H24N2OS
Mol. Mass.328.472
SMILESCc1cccc2cc(sc12)C(=O)N[C@@H]1C2CCN(CC2)C1(C)C