Reaction Details
TargetRAF proto-oncogene serine/threonine-protein kinase [Y340D,Y341D]
LigandBDBM322539
Substrate/Competitorn/a
IC50 52±n/a nM
Citation Bingham, MTestar, RGignoux, C Fused bicyclic (hetero)aromatic compounds useful for the treatment of cancers US Patent US10183939 Publication Date 1/22/2019
 
RAF proto-oncogene serine/threonine-protein kinase [Y340D,Y341D]
Name:RAF proto-oncogene serine/threonine-protein kinase [Y340D,Y341D]
Type:Serine/threonine-protein kinase
Mol. Mass.:72984.33
Organism:Homo sapiens (Human)
Description:P04049 Y340D Y341D
Residue:648
BDBM322539
NameBDBM322539
Synonyms:5-[3-(3-phenyl-1,2,4-oxadiazol-5-yl)chroman-6-yl]oxy-3,4-dihydro-1H-1,8-naphthyridin-2-one USRE49361, Example 17
TypeSmall organic molecule
Emp. Form.C25H20N4O4
Mol. Mass.440.4507
SMILESO=C1CCc2c(Oc3ccc4OCC(Cc4c3)c3nc(no3)-c3ccccc3)ccnc2N1