Reaction Details
TargetDipeptidyl peptidase 4
LigandBDBM11697
Substrate/CompetitorBDBM11526
Meas. Tech.Dipeptidyl Peptidase Inhibition Assay
pH8±n/a
Temperature310.15±n/a K
IC50 116±11 nM
Citation Tsu, HChen, XChen, CTLee, SJChang, CNKao, KHCoumar, MSYeh, YTChien, CHWang, HSLin, KTChang, YYWu, SHChen, YSLu, ILWu, SYTsai, TYChen, WCHsieh, HPChao, YSJiaang, WT 2-[3-[2-[(2S)-2-Cyano-1-pyrrolidinyl]-2-oxoethylamino]-3-methyl-1-oxobutyl]-1,2,3,4-tetrahydroisoquinoline: a potent, selective, and orally bioavailable dipeptide-derived inhibitor of dipeptidyl peptidase IV. J Med Chem49:373-80 (2006) 
 
Dipeptidyl peptidase 4
Name:Dipeptidyl peptidase 4
Type:Enzyme
Mol. Mass.:88271.01
Organism:Homo sapiens (Human)
Description:P27487
Residue:766
BDBM11697
BDBM11526
NameBDBM11697
Synonyms:(2S)-1-(2-{[3-oxo-3-(1,2,3,4-tetrahydroisoquinolin-2-yl)propyl]amino}acetyl)pyrrolidine-2-carbonitrile 2-[3-[2-[2-Cyano-(S)-pyrrolidin-1-yl]-2-oxoethylamino]-1-oxo-propyl]1,2,3,4-tetrahydroisoquinoline
TypeSmall organic molecule
Emp. Form.C19H24N4O2
Mol. Mass.340.4195
SMILESO=C(CNCCC(=O)N1CCc2ccccc2C1)N1CCC[C@H]1C#N